{"text_format":"1","workbook":"xlsx","n_sheets":6,"sheets":["Copertina","Database","Granulometric distribution","Metals","Organic contaminants","Comparison with law limits"],"not_rendered":{"charts":0,"images":26,"macros":1,"external_links":0,"defined_names":2,"comments":0,"pivot_tables":0},"unopened":[],"bounds":{"document_bytes":16777216,"sheet_cells":100000,"rows_first":2000,"rows_last":500,"rows_between":2000,"halvings":0,"cell_chars":16384,"cell_head_chars":4096},"cells_cut":0,"cells_raw":0,"read":"whole","date_system":"1900"}

{"sheet":"Copertina","index":0,"n_rows":51,"n_cols":1,"rows_kept":51,"cut":false,"hidden":false,"merged":[]}
[]
[]
[]
[]
["7.2.12\n Deliverable: Electronic database of separated fraction properties (actions 3.1 and 3.2)"]
[]
[]
[]
[]
[]
[]
[]
[]
[]
[]
[]
[]
[]
[]
[]
[]
[]
[]
[]
[]
[]
[]
[]
[]
[]
[]
[]
[]
[]
[]
[]
[]
[]
[]
[]
[]
[]
[]
["LIFE Project Number"]
["LIFE08 ENV/IT 000426"]
[]
["LIFE+ PROJECT NAME or Acronym"]
["“CO-ordinated Approach for Sediment Treatment and BEneficial reuse in Small harbours neTworks” \nCOAST_BEST"]
[]
[]
["The electronic database containing a user-friendly interface to extract and analyze data about the properties of the separated sediment fractions is provided as an attached electronic spreadsheet with added functionalities."]

{"sheet":"Database","index":1,"n_rows":1733,"n_cols":11,"rows_kept":1733,"cut":false,"hidden":false,"merged":[[1670,10,1672,13],[149,10,151,13],[346,10,349,13],[702,10,704,13],[900,10,903,13],[1444,10,1447,13],[1170,10,1172,13]]}
["Sediment","Fraction","Analysis","Element","Unit","Value / Concentration","D. Lgs. 152/06 Limit for soil type A ","D. Lgs. 152/06 Limit for soil type B","Respect for law limits Soil type A","Respect for law limits   Soil type B"]
["POCES 01","+0,5 mm","Granulometric Analysis",null,"%",2.95]
["POCES 01","-0,5 +0,053 mm","Granulometric Analysis",null,"%",28.73]
["POCES 01","-0,053 mm","Granulometric Analysis",null,"%",68.319999999999993]
["POCES 01","Dredged sediment","Shepard classification",null,null,"Sandy silt"]
["POCES 01","Dredged sediment","Nota classification",null,null,"Sandy pelite"]
["POCES 01","Dredged sediment","VS (%TS)",null,"%",19.12]
["POCES 01","Dredged sediment","TC (%TS)",null,"%",5.73]
["POCES 01","Dredged sediment","IC (%TS)",null,"%",1.62]
["POCES 01","Dredged sediment","TOC (%TS)",null,"%",4.12]
["POCES 01","Dredged sediment","O2 consumption (1626 h)",null,"(mg O2/kg TS)",8736.4699999999993]
["POCES 01","Dredged sediment","METALS","Zn ","mg/kg",269.2,150,1500,{"$f":"IF(F12<G12,\"Yes\",\"No\")","v":"No"},{"$f":"IF(F12<H12,\"Yes\",\"No\")","v":"Yes"}]
["POCES 01","Dredged sediment","METALS","Ni","mg/kg",66,120,500,{"$f":"IF(F13<G13,\"Yes\",\"No\")","v":"Yes"},{"$f":"IF(F13<H13,\"Yes\",\"No\")","v":"Yes"}]
["POCES 01","Dredged sediment","METALS","Cr","mg/kg",48,150,800,{"$f":"IF(F14<G14,\"Yes\",\"No\")","v":"Yes"},{"$f":"IF(F14<H14,\"Yes\",\"No\")","v":"Yes"}]
["POCES 01","Dredged sediment","METALS","Pb","mg/kg",76,100,1000,{"$f":"IF(F15<G15,\"Yes\",\"No\")","v":"Yes"},{"$f":"IF(F15<H15,\"Yes\",\"No\")","v":"Yes"}]
["POCES 01","Dredged sediment","METALS","As","μg/kg",20.399999999999999,20000,50000,"Yes","Yes"]
["POCES 01","Dredged sediment","METALS","Cd","μg/kg","not detected",2000,15000]
["POCES 01","-0,053 +0,020 mm","METALS","Zn ","mg/kg",243.95500000000001,150,1500,"No","Yes"]
["POCES 01","-0,053 +0,020 mm","METALS","Ni","mg/kg",81.534999999999997,120,500,"Yes","Yes"]
["POCES 01","-0,053 +0,020 mm","METALS","Cr","mg/kg",49.7,150,800,"Yes","Yes"]
["POCES 01","-0,053 +0,020 mm","METALS","Pb","mg/kg",107.345,100,1000,"No","Yes"]
["POCES 01","-0,053 +0,020 mm","METALS","As","μg/kg",10.455,20000,50000,"Yes","Yes"]
["POCES 01","-0,053 +0,020 mm","METALS","Cd","μg/kg","not detected",2000,15000]
["POCES 01","-0,020 mm","METALS","Zn ","mg/kg",263.63499999999999,150,1500,{"$f":"IF(F24<G24,\"Yes\",\"No\")","v":"No"},"Yes"]
["POCES 01","-0,020 mm","METALS","Ni","mg/kg",77.825000000000003,120,500,"Yes","Yes"]
["POCES 01","-0,020 mm","METALS","Cr","mg/kg",47.89,150,800,"Yes","Yes"]
["POCES 01","-0,020 mm","METALS","Pb","mg/kg",87.81,100,1000,"Yes","Yes"]
["POCES 01","-0,020 mm","METALS","As","μg/kg",23.67,20000,50000,"Yes","Yes"]
["POCES 01","-0,020 mm","METALS","Cd","μg/kg",3.9950000000000001,2000,15000,"Yes","Yes"]
["POCES 01","Dredged sediment","PAH","naphthalene ","ng/g",143,"-","-","-","-"]
["POCES 01","Dredged sediment","PAH","acenaphthene","ng/g",4,"-","-","-","-"]
["POCES 01","Dredged sediment","PAH","fluorene","ng/g",44,"-","-","-","-"]
["POCES 01","Dredged sediment","PAH","phenanthrene","ng/g",216,"-","-","-","-"]
["POCES 01","Dredged sediment","PAH","anthracene","ng/g",48,"-","-","-","-"]
["POCES 01","Dredged sediment","PAH","fluoranthene","ng/g",186,"-","-","-","-"]
["POCES 01","Dredged sediment","PAH","pyrene","ng/g",208,5000,50000,{"$f":"IF(F36<G36,\"Yes\",\"No\")","v":"Yes"},{"$f":"IF(F36<H36,\"Yes\",\"No\")","v":"Yes"}]
["POCES 01","Dredged sediment","PAH","benzo(a)anthracene","ng/g",105,500,10000,{"$f":"IF(F37<G37,\"Yes\",\"No\")","v":"Yes"},{"$f":"IF(F37<H37,\"Yes\",\"No\")","v":"Yes"}]
["POCES 01","Dredged sediment","PAH","chrysene","ng/g",249,5000,50000,"Yes","Yes"]
["POCES 01","Dredged sediment","PAH","benzo(b)fluoranthene","ng/g",133,500,10000,"Yes","Yes"]
["POCES 01","Dredged sediment","PAH","benzo(k)fluoranthene","ng/g",59,500,10000,"Yes","Yes"]
["POCES 01","Dredged sediment","PAH","benzo(a)pyrene","ng/g",104,100,10000,"No","Yes"]
["POCES 01","Dredged sediment","PAH","dibenzo(a,h)anthracene","ng/g",13,100,10000,"Yes","Yes"]
["POCES 01","Dredged sediment","PAH","benzo(g,h,i)perylene","ng/g",84,100,10000,"Yes","Yes"]
["POCES 01","Dredged sediment","PAH","indeno(1,2,3,c,d)pyrene","ng/g",56,100,5000,"Yes","Yes"]
["POCES 01","Dredged sediment","PAH","Sum PAH","ng/g",1649,10000,100000,"Yes","Yes"]
["POCES 01","-0,053 +0,020 mm","PAH","naphthalene ","ng/g",57,"-","-","-","-"]
["POCES 01","-0,053 +0,020 mm","PAH","acenaphthene","ng/g",1,"-","-","-","-"]
["POCES 01","-0,053 +0,020 mm","PAH","fluorene","ng/g",7,"-","-","-","-"]
["POCES 01","-0,053 +0,020 mm","PAH","phenanthrene","ng/g",59,"-","-","-","-"]
["POCES 01","-0,053 +0,020 mm","PAH","anthracene","ng/g",5,"-","-","-","-"]
["POCES 01","-0,053 +0,020 mm","PAH","fluoranthene","ng/g",46,"-","-","-","-"]
["POCES 01","-0,053 +0,020 mm","PAH","pyrene","ng/g",53,5000,50000,{"$f":"IF(F52<G52,\"Yes\",\"No\")","v":"Yes"},{"$f":"IF(F52<H52,\"Yes\",\"No\")","v":"Yes"}]
["POCES 01","-0,053 +0,020 mm","PAH","benzo(a)anthracene","ng/g",18,500,10000,{"$f":"IF(F53<G53,\"Yes\",\"No\")","v":"Yes"},{"$f":"IF(F53<H53,\"Yes\",\"No\")","v":"Yes"}]
["POCES 01","-0,053 +0,020 mm","PAH","chrysene","ng/g",34,5000,50000,"Yes","Yes"]
["POCES 01","-0,053 +0,020 mm","PAH","benzo(b)fluoranthene","ng/g",41,500,10000,"Yes","Yes"]
["POCES 01","-0,053 +0,020 mm","PAH","benzo(k)fluoranthene","ng/g",15,500,10000,"Yes","Yes"]
["POCES 01","-0,053 +0,020 mm","PAH","benzo(a)pyrene","ng/g",24,100,10000,"Yes","Yes"]
["POCES 01","-0,053 +0,020 mm","PAH","dibenzo(a,h)anthracene","ng/g","<LOQ",100,10000]
["POCES 01","-0,053 +0,020 mm","PAH","benzo(g,h,i)perylene","ng/g",26,100,10000,"Yes","Yes"]
["POCES 01","-0,053 +0,020 mm","PAH","indeno(1,2,3,c,d)pyrene","ng/g",7,100,5000,"Yes","Yes"]
["POCES 01","-0,053 +0,020 mm","PAH","Sum PAH","ng/g",393,10000,100000,"Yes","Yes"]
["POCES 01","-0,020 mm","PAH","naphthalene ","ng/g",81,"-","-","-","-"]
["POCES 01","-0,020 mm","PAH","acenaphthene","ng/g",1,"-","-","-","-"]
["POCES 01","-0,020 mm","PAH","fluorene","ng/g",6,"-","-","-","-"]
["POCES 01","-0,020 mm","PAH","phenanthrene","ng/g",44,"-","-","-","-"]
["POCES 01","-0,020 mm","PAH","anthracene","ng/g",3,"-","-","-","-"]
["POCES 01","-0,020 mm","PAH","fluoranthene","ng/g",45,"-","-","-","-"]
["POCES 01","-0,020 mm","PAH","pyrene","ng/g",44,5000,50000,{"$f":"IF(F68<G68,\"Yes\",\"No\")","v":"Yes"},{"$f":"IF(F68<H68,\"Yes\",\"No\")","v":"Yes"}]
["POCES 01","-0,020 mm","PAH","benzo(a)anthracene","ng/g",8,500,10000,{"$f":"IF(F69<G69,\"Yes\",\"No\")","v":"Yes"},{"$f":"IF(F69<H69,\"Yes\",\"No\")","v":"Yes"}]
["POCES 01","-0,020 mm","PAH","chrysene","ng/g",17,5000,50000,"Yes","Yes"]
["POCES 01","-0,020 mm","PAH","benzo(b)fluoranthene","ng/g",34,500,10000,"Yes","Yes"]
["POCES 01","-0,020 mm","PAH","benzo(k)fluoranthene","ng/g",7,500,10000,"Yes","Yes"]
["POCES 01","-0,020 mm","PAH","benzo(a)pyrene","ng/g",11,100,10000,"Yes","Yes"]
["POCES 01","-0,020 mm","PAH","dibenzo(a,h)anthracene","ng/g",2,100,10000,{"$f":"IF(F74<G74,\"Yes\",\"No\")","v":"Yes"},"Yes"]
["POCES 01","-0,020 mm","PAH","benzo(g,h,i)perylene","ng/g",21,100,10000,"Yes","Yes"]
["POCES 01","-0,020 mm","PAH","indeno(1,2,3,c,d)pyrene","ng/g",3,100,5000,"Yes","Yes"]
["POCES 01","-0,020 mm","PAH","Sum PAH","ng/g",326,10000,100000,"Yes","Yes"]
["POCES 01","Dredged sediment","PCB","PCB 28","ng/g",0.4,"-","-","-","-"]
["POCES 01","Dredged sediment","PCB","PCB 52","ng/g",0.7,"-","-","-","-"]
["POCES 01","Dredged sediment","PCB","PCB 101","ng/g",1.8,"-","-","-","-"]
["POCES 01","Dredged sediment","PCB","PCB 81","ng/g","<LOQ","-","-","-","-"]
["POCES 01","Dredged sediment","PCB","PCB 77","ng/g",0.3,"-","-","-","-"]
["POCES 01","Dredged sediment","PCB","PCB123","ng/g","<LOQ","-","-","-","-"]
["POCES 01","Dredged sediment","PCB","PCB 118","ng/g",0.9,"-","-","-","-"]
["POCES 01","Dredged sediment","PCB","PCB 114","ng/g","<LOQ","-","-","-","-"]
["POCES 01","Dredged sediment","PCB","PCB 153","ng/g",2.5,"-","-","-","-"]
["POCES 01","Dredged sediment","PCB","PCB 105","ng/g",0.4,"-","-","-","-"]
["POCES 01","Dredged sediment","PCB","PCB 138","ng/g",2.1,"-","-","-","-"]
["POCES 01","Dredged sediment","PCB","PCB 126","ng/g","<LOQ","-","-","-","-"]
["POCES 01","Dredged sediment","PCB","PCB 128","ng/g",0.3,"-","-","-","-"]
["POCES 01","Dredged sediment","PCB","PCB167","ng/g",0.1,"-","-","-","-"]
["POCES 01","Dredged sediment","PCB","PCB 156","ng/g",0.2,"-","-","-","-"]
["POCES 01","Dredged sediment","PCB","PCB 157","ng/g","<LOQ","-","-","-","-"]
["POCES 01","Dredged sediment","PCB","PCB 180","ng/g",1.2,"-","-","-","-"]
["POCES 01","Dredged sediment","PCB","PCB 170","ng/g",0.6,"-","-","-","-"]
["POCES 01","Dredged sediment","PCB","PCB 169","ng/g","<LOQ","-","-","-","-"]
["POCES 01","Dredged sediment","PCB","PCB 189","ng/g","<LOQ","-","-","-","-"]
["POCES 01","Dredged sediment","PCB","PCB 209","ng/g",0.2,"-","-","-","-"]
["POCES 01","Dredged sediment","PCB","Sum PCB","ng/g",11.7,60,5000,{"$f":"IF(F99<G99,\"Yes\",\"No\")","v":"Yes"},{"$f":"IF(F99<H99,\"Yes\",\"No\")","v":"Yes"}]
["POCES 01","Dredged sediment","PCB","CB 110","ng/g",1.2,"-","-","-","-"]
["POCES 01","-0,053 +0,020 mm","PCB","PCB 28","ng/g",0.2,"-","-","-","-"]
["POCES 01","-0,053 +0,020 mm","PCB","PCB 52","ng/g",0.3,"-","-","-","-"]
["POCES 01","-0,053 +0,020 mm","PCB","PCB 101","ng/g",0.8,"-","-","-","-"]
["POCES 01","-0,053 +0,020 mm","PCB","PCB 81","ng/g","<LOQ","-","-","-","-"]
["POCES 01","-0,053 +0,020 mm","PCB","PCB 77","ng/g",0.1,"-","-","-","-"]
["POCES 01","-0,053 +0,020 mm","PCB","PCB123","ng/g","<LOQ","-","-","-","-"]
["POCES 01","-0,053 +0,020 mm","PCB","PCB 118","ng/g",0.7,"-","-","-","-"]
["POCES 01","-0,053 +0,020 mm","PCB","PCB 114","ng/g","<LOQ","-","-","-","-"]
["POCES 01","-0,053 +0,020 mm","PCB","PCB 153","ng/g",1.3,"-","-","-","-"]
["POCES 01","-0,053 +0,020 mm","PCB","PCB 105","ng/g",0.2,"-","-","-","-"]
["POCES 01","-0,053 +0,020 mm","PCB","PCB 138","ng/g",1.1000000000000001,"-","-","-","-"]
["POCES 01","-0,053 +0,020 mm","PCB","PCB 126","ng/g","<LOQ","-","-","-","-"]
["POCES 01","-0,053 +0,020 mm","PCB","PCB 128","ng/g",0.1,"-","-","-","-"]
["POCES 01","-0,053 +0,020 mm","PCB","PCB167","ng/g","<LOQ","-","-","-","-"]
["POCES 01","-0,053 +0,020 mm","PCB","PCB 156","ng/g",0.1,"-","-","-","-"]
["POCES 01","-0,053 +0,020 mm","PCB","PCB 157","ng/g","<LOQ","-","-","-","-"]
["POCES 01","-0,053 +0,020 mm","PCB","PCB 180","ng/g",0.6,"-","-","-","-"]
["POCES 01","-0,053 +0,020 mm","PCB","PCB 170","ng/g",0.3,"-","-","-","-"]
["POCES 01","-0,053 +0,020 mm","PCB","PCB 169","ng/g","<LOQ","-","-","-","-"]
["POCES 01","-0,053 +0,020 mm","PCB","PCB 189","ng/g","<LOQ","-","-","-","-"]
["POCES 01","-0,053 +0,020 mm","PCB","PCB 209","ng/g",0.1,"-","-","-","-"]
["POCES 01","-0,053 +0,020 mm","PCB","Sum PCB","ng/g",6,60,5000,{"$f":"IF(F122<G122,\"Yes\",\"No\")","v":"Yes"},{"$f":"IF(F122<H122,\"Yes\",\"No\")","v":"Yes"}]
["POCES 01","-0,053 +0,020 mm","PCB","CB 110","ng/g",0.6,"-","-","-","-"]
["POCES 01","-0,020 mm","PCB","PCB 28","ng/g",0.3,"-","-","-","-"]
["POCES 01","-0,020 mm","PCB","PCB 52","ng/g",0.5,"-","-","-","-"]
["POCES 01","-0,020 mm","PCB","PCB 101","ng/g",1.1000000000000001,"-","-","-","-"]
["POCES 01","-0,020 mm","PCB","PCB 81","ng/g","<LOQ","-","-","-","-"]
["POCES 01","-0,020 mm","PCB","PCB 77","ng/g",0.1,"-","-","-","-"]
["POCES 01","-0,020 mm","PCB","PCB123","ng/g","<LOQ","-","-","-","-"]
["POCES 01","-0,020 mm","PCB","PCB 118","ng/g",0.8,"-","-","-","-"]
["POCES 01","-0,020 mm","PCB","PCB 114","ng/g","<LOQ","-","-","-","-"]
["POCES 01","-0,020 mm","PCB","PCB 153","ng/g",2.2000000000000002,"-","-","-","-"]
["POCES 01","-0,020 mm","PCB","PCB 105","ng/g",0.4,"-","-","-","-"]
["POCES 01","-0,020 mm","PCB","PCB 138","ng/g",1.8,"-","-","-","-"]
["POCES 01","-0,020 mm","PCB","PCB 126","ng/g","<LOQ","-","-","-","-"]
["POCES 01","-0,020 mm","PCB","PCB 128","ng/g",0.3,"-","-","-","-"]
["POCES 01","-0,020 mm","PCB","PCB167","ng/g","<LOQ","-","-","-","-"]
["POCES 01","-0,020 mm","PCB","PCB 156","ng/g",0.1,"-","-","-","-"]
["POCES 01","-0,020 mm","PCB","PCB 157","ng/g","<LOQ","-","-","-","-"]
["POCES 01","-0,020 mm","PCB","PCB 180","ng/g",1.2,"-","-","-","-"]
["POCES 01","-0,020 mm","PCB","PCB 170","ng/g",0.5,"-","-","-","-"]
["POCES 01","-0,020 mm","PCB","PCB 169","ng/g","<LOQ","-","-","-","-"]
["POCES 01","-0,020 mm","PCB","PCB 189","ng/g","<LOQ","-","-","-","-"]
["POCES 01","-0,020 mm","PCB","PCB 209","ng/g",0.2,"-","-","-","-"]
["POCES 01","-0,020 mm","PCB","Sum PCB","ng/g",9.5,60,5000,{"$f":"IF(F145<G145,\"Yes\",\"No\")","v":"Yes"},{"$f":"IF(F145<H145,\"Yes\",\"No\")","v":"Yes"}]
["POCES 01","-0,020 mm","PCB","CB 110","ng/g",1,"-","-","-","-"]
["POCES 01","Dredged sediment","Hydrocarbons (C > 12 mg/kg)",null,"mg/kg",72.39,50,750,{"$f":"IF(F147<G147,\"Yes\",\"No\")","v":"No"},{"$f":"IF(F147<H147,\"Yes\",\"No\")","v":"Yes"}]
["POCES 01","-0,053 +0,020 mm","Hydrocarbons (C > 12 mg/kg)",null,"mg/kg",42.67,50,750,"Yes","Yes"]
["POCES 01","-0,020 mm","Hydrocarbons (C > 12 mg/kg)",null,"mg/kg",90.94,50,750,{"$f":"IF(F149<G149,\"Yes\",\"No\")","v":"No"},{"$f":"IF(F149<H149,\"Yes\",\"No\")","v":"Yes"}]
["POCES 01","Dredged sediment","Tributyltin ",null,"μg/kg","6,48 *",null,null,null,null,"*D. Lgs. 152/06: environmental quality standards in sediments expressed as the annual average   (SQA-MA) = 5 µg/kg SS * "]
["POCES 01","-0,053 +0,020 mm","Tributyltin ",null,"μg/kg","10,90 *"]
["POCES 01","-0,020 mm","Tributyltin ",null,"μg/kg","6,90 *"]
["POCES 02","+0,5 mm","Granulometric Analysis",null,"%",2.57]
["POCES 02","-0,5 +0,053 mm","Granulometric Analysis",null,"%",33.409999999999997]
["POCES 02","-0,053 mm","Granulometric Analysis",null,"%",64.02]
["POCES 02","Dredged sediment","Shepard classification",null,null,"Sandy silt"]
["POCES 02","Dredged sediment","Nota classification",null,null,"Sandy pelite"]
["POCES 02","Dredged sediment","VS (%TS)",null,"%",14.78]
["POCES 02","Dredged sediment","TC (%TS)",null,"%",4.41]
["POCES 02","Dredged sediment","IC (%TS)",null,"%",1.8]
["POCES 02","Dredged sediment","TOC (%TS)",null,"%",2.61]
["POCES 02","Dredged sediment","O2 consumption (1626 h)",null,"(mg O2/kg TS)",7410.61]
["POCES 02","Dredged sediment","METALS","Zn ","mg/kg",227.17,150,1500,"No","Yes"]
["POCES 02","Dredged sediment","METALS","Ni","mg/kg",71.864999999999995,120,500,"Yes","Yes"]
["POCES 02","Dredged sediment","METALS","Cr","mg/kg",49.91,150,800,"Yes","Yes"]
["POCES 02","Dredged sediment","METALS","Pb","mg/kg",57.89,100,1000,{"$f":"IF(F166<G166,\"Yes\",\"No\")","v":"Yes"},{"$f":"IF(F166<H166,\"Yes\",\"No\")","v":"Yes"}]
["POCES 02","Dredged sediment","METALS","As","μg/kg",33.42,20000,50000,"Yes","Yes"]
["POCES 02","Dredged sediment","METALS","Cd","μg/kg","not detected",2000,15000]
["POCES 02","-0,125 +0,053 mm","METALS","Zn ","mg/kg",282.67,150,1500,"No","Yes"]
["POCES 02","-0,125 +0,053 mm","METALS","Ni","mg/kg",77.844999999999999,120,500,"Yes","Yes"]
["POCES 02","-0,125 +0,053 mm","METALS","Cr","mg/kg",49.91,150,800,"Yes","Yes"]
["POCES 02","-0,125 +0,053 mm","METALS","Pb","mg/kg",61.884999999999998,100,1000,"Yes","Yes"]
["POCES 02","-0,125 +0,053 mm","METALS","As","μg/kg",14.375,20000,50000,"Yes","Yes"]
["POCES 02","-0,125 +0,053 mm","METALS","Cd","μg/kg",5.9950000000000001,2000,15000,"Yes","Yes"]
["POCES 02","-0,053 +0,020 mm","METALS","Zn ","mg/kg",179.42500000000001,150,1500,"No","Yes"]
["POCES 02","-0,053 +0,020 mm","METALS","Ni","mg/kg",65.86,120,500,"Yes","Yes"]
["POCES 02","-0,053 +0,020 mm","METALS","Cr","mg/kg",43.91,150,800,"Yes","Yes"]
["POCES 02","-0,053 +0,020 mm","METALS","Pb","mg/kg",71.844999999999999,100,1000,"Yes","Yes"]
["POCES 02","-0,053 +0,020 mm","METALS","As","μg/kg",14.13,20000,50000,"Yes","Yes"]
["POCES 02","-0,053 +0,020 mm","METALS","Cd","μg/kg",0,2000,15000,"Yes","Yes"]
["POCES 02","-0,020 mm","METALS","Zn ","mg/kg",210.57499999999999,150,1500,"No","Yes"]
["POCES 02","-0,020 mm","METALS","Ni","mg/kg",69.905000000000001,120,500,"Yes","Yes"]
["POCES 02","-0,020 mm","METALS","Cr","mg/kg",43.91,150,800,"Yes","Yes"]
["POCES 02","-0,020 mm","METALS","Pb","mg/kg",75.855000000000004,100,1000,"Yes","Yes"]
["POCES 02","-0,020 mm","METALS","As","μg/kg",24.07,20000,50000,"Yes","Yes"]
["POCES 02","-0,020 mm","METALS","Cd","μg/kg",5.9850000000000003,2000,15000,"Yes","Yes"]
["POCES 02","Dredged sediment","PAH","naphthalene ","ng/g",78,"-","-","-","-"]
["POCES 02","Dredged sediment","PAH","acenaphthene","ng/g",15,"-","-","-","-"]
["POCES 02","Dredged sediment","PAH","fluorene","ng/g",34,"-","-","-","-"]
["POCES 02","Dredged sediment","PAH","phenanthrene","ng/g",508,"-","-","-","-"]
["POCES 02","Dredged sediment","PAH","anthracene","ng/g",85,"-","-","-","-"]
["POCES 02","Dredged sediment","PAH","fluoranthene","ng/g",633,"-","-","-","-"]
["POCES 02","Dredged sediment","PAH","pyrene","ng/g",472,5000,50000,{"$f":"IF(F193<G193,\"Yes\",\"No\")","v":"Yes"},{"$f":"IF(F193<H193,\"Yes\",\"No\")","v":"Yes"}]
["POCES 02","Dredged sediment","PAH","benzo(a)anthracene","ng/g",229,500,10000,{"$f":"IF(F194<G194,\"Yes\",\"No\")","v":"Yes"},{"$f":"IF(F194<H194,\"Yes\",\"No\")","v":"Yes"}]
["POCES 02","Dredged sediment","PAH","chrysene","ng/g",321,5000,50000,"Yes","Yes"]
["POCES 02","Dredged sediment","PAH","benzo(b)fluoranthene","ng/g",295,500,10000,"Yes","Yes"]
["POCES 02","Dredged sediment","PAH","benzo(k)fluoranthene","ng/g",130,500,10000,"Yes","Yes"]
["POCES 02","Dredged sediment","PAH","benzo(a)pyrene","ng/g",226,100,10000,"No","Yes"]
["POCES 02","Dredged sediment","PAH","dibenzo(a,h)anthracene","ng/g",30,100,10000,"Yes","Yes"]
["POCES 02","Dredged sediment","PAH","benzo(g,h,i)perylene","ng/g",160,100,10000,"No","Yes"]
["POCES 02","Dredged sediment","PAH","indeno(1,2,3,c,d)pyrene","ng/g",69,100,5000,"Yes","Yes"]
["POCES 02","Dredged sediment","PAH","Sum PAH","ng/g",3284,10000,100000,"Yes","Yes"]
["POCES 02","-0,125 +0,053 mm","PAH","naphthalene ","ng/g",97,"-","-","-","-"]
["POCES 02","-0,125 +0,053 mm","PAH","acenaphthene","ng/g",4,"-","-","-","-"]
["POCES 02","-0,125 +0,053 mm","PAH","fluorene","ng/g",29,"-","-","-","-"]
["POCES 02","-0,125 +0,053 mm","PAH","phenanthrene","ng/g",204,"-","-","-","-"]
["POCES 02","-0,125 +0,053 mm","PAH","anthracene","ng/g",21,"-","-","-","-"]
["POCES 02","-0,125 +0,053 mm","PAH","fluoranthene","ng/g",171,"-","-","-","-"]
["POCES 02","-0,125 +0,053 mm","PAH","pyrene","ng/g",192,5000,50000,{"$f":"IF(F209<G209,\"Yes\",\"No\")","v":"Yes"},{"$f":"IF(F209<H209,\"Yes\",\"No\")","v":"Yes"}]
["POCES 02","-0,125 +0,053 mm","PAH","benzo(a)anthracene","ng/g",72,500,10000,{"$f":"IF(F210<G210,\"Yes\",\"No\")","v":"Yes"},"Yes"]
["POCES 02","-0,125 +0,053 mm","PAH","chrysene","ng/g",137,5000,50000,"Yes","Yes"]
["POCES 02","-0,125 +0,053 mm","PAH","benzo(b)fluoranthene","ng/g",121,500,10000,"Yes","Yes"]
["POCES 02","-0,125 +0,053 mm","PAH","benzo(k)fluoranthene","ng/g",51,500,10000,"Yes","Yes"]
["POCES 02","-0,125 +0,053 mm","PAH","benzo(a)pyrene","ng/g",100,100,10000,"No","Yes"]
["POCES 02","-0,125 +0,053 mm","PAH","dibenzo(a,h)anthracene","ng/g",11,100,10000,"Yes","Yes"]
["POCES 02","-0,125 +0,053 mm","PAH","benzo(g,h,i)perylene","ng/g",79,100,10000,"Yes","Yes"]
["POCES 02","-0,125 +0,053 mm","PAH","indeno(1,2,3,c,d)pyrene","ng/g",61,100,5000,"Yes","Yes"]
["POCES 02","-0,125 +0,053 mm","PAH","Sum PAH","ng/g",1350,10000,100000,"Yes","Yes"]
["POCES 02","-0,053 +0,020 mm","PAH","naphthalene ","ng/g",47,"-","-","-","-"]
["POCES 02","-0,053 +0,020 mm","PAH","acenaphthene","ng/g",1,"-","-","-","-"]
["POCES 02","-0,053 +0,020 mm","PAH","fluorene","ng/g",7,"-","-","-","-"]
["POCES 02","-0,053 +0,020 mm","PAH","phenanthrene","ng/g",53,"-","-","-","-"]
["POCES 02","-0,053 +0,020 mm","PAH","anthracene","ng/g",4,"-","-","-","-"]
["POCES 02","-0,053 +0,020 mm","PAH","fluoranthene","ng/g",38,"-","-","-","-"]
["POCES 02","-0,053 +0,020 mm","PAH","pyrene","ng/g",47,5000,50000,{"$f":"IF(F225<G225,\"Yes\",\"No\")","v":"Yes"},{"$f":"IF(F225<H225,\"Yes\",\"No\")","v":"Yes"}]
["POCES 02","-0,053 +0,020 mm","PAH","benzo(a)anthracene","ng/g",15,500,10000,{"$f":"IF(F226<G226,\"Yes\",\"No\")","v":"Yes"},"Yes"]
["POCES 02","-0,053 +0,020 mm","PAH","chrysene","ng/g",30,5000,50000,"Yes","Yes"]
["POCES 02","-0,053 +0,020 mm","PAH","benzo(b)fluoranthene","ng/g",36,500,10000,"Yes","Yes"]
["POCES 02","-0,053 +0,020 mm","PAH","benzo(k)fluoranthene","ng/g",12,500,10000,"Yes","Yes"]
["POCES 02","-0,053 +0,020 mm","PAH","benzo(a)pyrene","ng/g",21,100,10000,"Yes","Yes"]
["POCES 02","-0,053 +0,020 mm","PAH","dibenzo(a,h)anthracene","ng/g",3,100,10000,"Yes","Yes"]
["POCES 02","-0,053 +0,020 mm","PAH","benzo(g,h,i)perylene","ng/g",23,100,10000,"Yes","Yes"]
["POCES 02","-0,053 +0,020 mm","PAH","indeno(1,2,3,c,d)pyrene","ng/g",17,100,5000,"Yes","Yes"]
["POCES 02","-0,053 +0,020 mm","PAH","Sum PAH","ng/g",355,10000,100000,"Yes","Yes"]
["POCES 02","-0,020 mm","PAH","naphthalene ","ng/g",65,"-","-","-","-"]
["POCES 02","-0,020 mm","PAH","acenaphthene","ng/g",1,"-","-","-","-"]
["POCES 02","-0,020 mm","PAH","fluorene","ng/g",5,"-","-","-","-"]
["POCES 02","-0,020 mm","PAH","phenanthrene","ng/g",42,"-","-","-","-"]
["POCES 02","-0,020 mm","PAH","anthracene","ng/g",2,"-","-","-","-"]
["POCES 02","-0,020 mm","PAH","fluoranthene","ng/g",30,"-","-","-","-"]
["POCES 02","-0,020 mm","PAH","pyrene","ng/g",32,5000,50000,{"$f":"IF(F241<G241,\"Yes\",\"No\")","v":"Yes"},{"$f":"IF(F241<H241,\"Yes\",\"No\")","v":"Yes"}]
["POCES 02","-0,020 mm","PAH","benzo(a)anthracene","ng/g",7,500,10000,{"$f":"IF(F242<G242,\"Yes\",\"No\")","v":"Yes"},"Yes"]
["POCES 02","-0,020 mm","PAH","chrysene","ng/g",17,5000,50000,"Yes","Yes"]
["POCES 02","-0,020 mm","PAH","benzo(b)fluoranthene","ng/g",28,500,10000,"Yes","Yes"]
["POCES 02","-0,020 mm","PAH","benzo(k)fluoranthene","ng/g",7,500,10000,"Yes","Yes"]
["POCES 02","-0,020 mm","PAH","benzo(a)pyrene","ng/g",10,100,10000,"Yes","Yes"]
["POCES 02","-0,020 mm","PAH","dibenzo(a,h)anthracene","ng/g",2,100,10000,"Yes","Yes"]
["POCES 02","-0,020 mm","PAH","benzo(g,h,i)perylene","ng/g",18,100,10000,"Yes","Yes"]
["POCES 02","-0,020 mm","PAH","indeno(1,2,3,c,d)pyrene","ng/g",3,100,5000,"Yes","Yes"]
["POCES 02","-0,020 mm","PAH","Sum PAH","ng/g",268,10000,100000,"Yes","Yes"]
["POCES 02","Dredged sediment","PCB","PCB 28","ng/g",0.4,"-","-","-","-"]
["POCES 02","Dredged sediment","PCB","PCB 52","ng/g",0.6,"-","-","-","-"]
["POCES 02","Dredged sediment","PCB","PCB 101","ng/g",1.6,"-","-","-","-"]
["POCES 02","Dredged sediment","PCB","PCB 81","ng/g","<LOQ","-","-","-","-"]
["POCES 02","Dredged sediment","PCB","PCB 77","ng/g",0.2,"-","-","-","-"]
["POCES 02","Dredged sediment","PCB","PCB123","ng/g","<LOQ","-","-","-","-"]
["POCES 02","Dredged sediment","PCB","PCB 118","ng/g",1,"-","-","-","-"]
["POCES 02","Dredged sediment","PCB","PCB 114","ng/g","<LOQ","-","-","-","-"]
["POCES 02","Dredged sediment","PCB","PCB 153","ng/g",2.4,"-","-","-","-"]
["POCES 02","Dredged sediment","PCB","PCB 105","ng/g",0.4,"-","-","-","-"]
["POCES 02","Dredged sediment","PCB","PCB 138","ng/g",2.1,"-","-","-","-"]
["POCES 02","Dredged sediment","PCB","PCB 126","ng/g","<LOQ","-","-","-","-"]
["POCES 02","Dredged sediment","PCB","PCB 128","ng/g",0.4,"-","-","-","-"]
["POCES 02","Dredged sediment","PCB","PCB167","ng/g",0.1,"-","-","-","-"]
["POCES 02","Dredged sediment","PCB","PCB 156","ng/g",0.1,"-","-","-","-"]
["POCES 02","Dredged sediment","PCB","PCB 157","ng/g","<LOQ","-","-","-","-"]
["POCES 02","Dredged sediment","PCB","PCB 180","ng/g",0.9,"-","-","-","-"]
["POCES 02","Dredged sediment","PCB","PCB 170","ng/g",0.4,"-","-","-","-"]
["POCES 02","Dredged sediment","PCB","PCB 169","ng/g","<LOQ","-","-","-","-"]
["POCES 02","Dredged sediment","PCB","PCB 189","ng/g","<LOQ","-","-","-","-"]
["POCES 02","Dredged sediment","PCB","PCB 209","ng/g",0.2,"-","-","-","-"]
["POCES 02","Dredged sediment","PCB","Sum PCB","ng/g",10.7,60,5000,{"$f":"IF(F272<G272,\"Yes\",\"No\")","v":"Yes"},{"$f":"IF(F272<H272,\"Yes\",\"No\")","v":"Yes"}]
["POCES 02","Dredged sediment","PCB","CB 110","ng/g",1.1000000000000001,"-","-","-","-"]
["POCES 02","-0,125 +0,053 mm","PCB","PCB 28","ng/g",0.6,"-","-","-","-"]
["POCES 02","-0,125 +0,053 mm","PCB","PCB 52","ng/g",0.6,"-","-","-","-"]
["POCES 02","-0,125 +0,053 mm","PCB","PCB 101","ng/g",1.8,"-","-","-","-"]
["POCES 02","-0,125 +0,053 mm","PCB","PCB 81","ng/g","<LOQ","-","-","-","-"]
["POCES 02","-0,125 +0,053 mm","PCB","PCB 77","ng/g",0.4,"-","-","-","-"]
["POCES 02","-0,125 +0,053 mm","PCB","PCB123","ng/g","<LOQ","-","-","-","-"]
["POCES 02","-0,125 +0,053 mm","PCB","PCB 118","ng/g",1,"-","-","-","-"]
["POCES 02","-0,125 +0,053 mm","PCB","PCB 114","ng/g","<LOQ","-","-","-","-"]
["POCES 02","-0,125 +0,053 mm","PCB","PCB 153","ng/g",2.8,"-","-","-","-"]
["POCES 02","-0,125 +0,053 mm","PCB","PCB 105","ng/g",0.4,"-","-","-","-"]
["POCES 02","-0,125 +0,053 mm","PCB","PCB 138","ng/g",2.2000000000000002,"-","-","-","-"]
["POCES 02","-0,125 +0,053 mm","PCB","PCB 126","ng/g","<LOQ","-","-","-","-"]
["POCES 02","-0,125 +0,053 mm","PCB","PCB 128","ng/g",0.3,"-","-","-","-"]
["POCES 02","-0,125 +0,053 mm","PCB","PCB167","ng/g",0.1,"-","-","-","-"]
["POCES 02","-0,125 +0,053 mm","PCB","PCB 156","ng/g",0.2,"-","-","-","-"]
["POCES 02","-0,125 +0,053 mm","PCB","PCB 157","ng/g","<LOQ","-","-","-","-"]
["POCES 02","-0,125 +0,053 mm","PCB","PCB 180","ng/g",1.5,"-","-","-","-"]
["POCES 02","-0,125 +0,053 mm","PCB","PCB 170","ng/g",0.6,"-","-","-","-"]
["POCES 02","-0,125 +0,053 mm","PCB","PCB 169","ng/g","<LOQ","-","-","-","-"]
["POCES 02","-0,125 +0,053 mm","PCB","PCB 189","ng/g","<LOQ","-","-","-","-"]
["POCES 02","-0,125 +0,053 mm","PCB","PCB 209","ng/g",0.2,"-","-","-","-"]
["POCES 02","-0,125 +0,053 mm","PCB","Sum PCB","ng/g",12.6,60,5000,{"$f":"IF(F295<G295,\"Yes\",\"No\")","v":"Yes"},{"$f":"IF(F295<H295,\"Yes\",\"No\")","v":"Yes"}]
["POCES 02","-0,125 +0,053 mm","PCB","CB 110","ng/g",1.3,"-","-","-","-"]
["POCES 02","-0,053 +0,020 mm","PCB","PCB 28","ng/g",0.3,"-","-","-","-"]
["POCES 02","-0,053 +0,020 mm","PCB","PCB 52","ng/g",0.4,"-","-","-","-"]
["POCES 02","-0,053 +0,020 mm","PCB","PCB 101","ng/g",1,"-","-","-","-"]
["POCES 02","-0,053 +0,020 mm","PCB","PCB 81","ng/g","<LOQ","-","-","-","-"]
["POCES 02","-0,053 +0,020 mm","PCB","PCB 77","ng/g",0.1,"-","-","-","-"]
["POCES 02","-0,053 +0,020 mm","PCB","PCB123","ng/g","<LOQ","-","-","-","-"]
["POCES 02","-0,053 +0,020 mm","PCB","PCB 118","ng/g",0.6,"-","-","-","-"]
["POCES 02","-0,053 +0,020 mm","PCB","PCB 114","ng/g","<LOQ","-","-","-","-"]
["POCES 02","-0,053 +0,020 mm","PCB","PCB 153","ng/g",1.6,"-","-","-","-"]
["POCES 02","-0,053 +0,020 mm","PCB","PCB 105","ng/g",0.2,"-","-","-","-"]
["POCES 02","-0,053 +0,020 mm","PCB","PCB 138","ng/g",1.3,"-","-","-","-"]
["POCES 02","-0,053 +0,020 mm","PCB","PCB 126","ng/g","<LOQ","-","-","-","-"]
["POCES 02","-0,053 +0,020 mm","PCB","PCB 128","ng/g",0.2,"-","-","-","-"]
["POCES 02","-0,053 +0,020 mm","PCB","PCB167","ng/g","<LOQ","-","-","-","-"]
["POCES 02","-0,053 +0,020 mm","PCB","PCB 156","ng/g",0.1,"-","-","-","-"]
["POCES 02","-0,053 +0,020 mm","PCB","PCB 157","ng/g","<LOQ","-","-","-","-"]
["POCES 02","-0,053 +0,020 mm","PCB","PCB 180","ng/g",0.9,"-","-","-","-"]
["POCES 02","-0,053 +0,020 mm","PCB","PCB 170","ng/g",0.3,"-","-","-","-"]
["POCES 02","-0,053 +0,020 mm","PCB","PCB 169","ng/g","<LOQ","-","-","-","-"]
["POCES 02","-0,053 +0,020 mm","PCB","PCB 189","ng/g","<LOQ","-","-","-","-"]
["POCES 02","-0,053 +0,020 mm","PCB","PCB 209","ng/g",0.2,"-","-","-","-"]
["POCES 02","-0,053 +0,020 mm","PCB","Sum PCB","ng/g",7.3,60,5000,{"$f":"IF(F318<G318,\"Yes\",\"No\")","v":"Yes"},{"$f":"IF(F318<H318,\"Yes\",\"No\")","v":"Yes"}]
["POCES 02","-0,053 +0,020 mm","PCB","CB 110","ng/g",0.7,"-","-","-","-"]
["POCES 02","-0,020 mm","PCB","PCB 28","ng/g",0.3,"-","-","-","-"]
["POCES 02","-0,020 mm","PCB","PCB 52","ng/g",0.5,"-","-","-","-"]
["POCES 02","-0,020 mm","PCB","PCB 101","ng/g",1.2,"-","-","-","-"]
["POCES 02","-0,020 mm","PCB","PCB 81","ng/g","<LOQ","-","-","-","-"]
["POCES 02","-0,020 mm","PCB","PCB 77","ng/g",0.1,"-","-","-","-"]
["POCES 02","-0,020 mm","PCB","PCB123","ng/g","<LOQ","-","-","-","-"]
["POCES 02","-0,020 mm","PCB","PCB 118","ng/g",0.7,"-","-","-","-"]
["POCES 02","-0,020 mm","PCB","PCB 114","ng/g","<LOQ","-","-","-","-"]
["POCES 02","-0,020 mm","PCB","PCB 153","ng/g",1.8,"-","-","-","-"]
["POCES 02","-0,020 mm","PCB","PCB 105","ng/g",0.3,"-","-","-","-"]
["POCES 02","-0,020 mm","PCB","PCB 138","ng/g",1.5,"-","-","-","-"]
["POCES 02","-0,020 mm","PCB","PCB 126","ng/g","<LOQ","-","-","-","-"]
["POCES 02","-0,020 mm","PCB","PCB 128","ng/g",0.2,"-","-","-","-"]
["POCES 02","-0,020 mm","PCB","PCB167","ng/g","<LOQ","-","-","-","-"]
["POCES 02","-0,020 mm","PCB","PCB 156","ng/g",0.1,"-","-","-","-"]
["POCES 02","-0,020 mm","PCB","PCB 157","ng/g","<LOQ","-","-","-","-"]
["POCES 02","-0,020 mm","PCB","PCB 180","ng/g",0.8,"-","-","-","-"]
["POCES 02","-0,020 mm","PCB","PCB 170","ng/g",0.4,"-","-","-","-"]
["POCES 02","-0,020 mm","PCB","PCB 169","ng/g","<LOQ","-","-","-","-"]
["POCES 02","-0,020 mm","PCB","PCB 189","ng/g","<LOQ","-","-","-","-"]
["POCES 02","-0,020 mm","PCB","PCB 209","ng/g",0.2,"-","-","-","-"]
["POCES 02","-0,020 mm","PCB","Sum PCB","ng/g",7.9,60,5000,{"$f":"IF(F341<G341,\"Yes\",\"No\")","v":"Yes"},{"$f":"IF(F341<H341,\"Yes\",\"No\")","v":"Yes"}]
["POCES 02","-0,020 mm","PCB","CB 110","ng/g",0.8,"-","-","-","-"]
["POCES 02","Dredged sediment","Hydrocarbons (C > 12 mg/kg)",null,"mg/kg",64.8,50,750,{"$f":"IF(F343<G343,\"Yes\",\"No\")","v":"No"},{"$f":"IF(F343<H343,\"Yes\",\"No\")","v":"Yes"}]
["POCES 02","-0,125 +0,053 mm","Hydrocarbons (C > 12 mg/kg)",null,"mg/kg",43.94,50,750,"Yes","Yes"]
["POCES 02","-0,053 +0,020 mm","Hydrocarbons (C > 12 mg/kg)",null,"mg/kg",46.67,50,750,"Yes","Yes"]
["POCES 02","-0,020 mm","Hydrocarbons (C > 12 mg/kg)",null,"mg/kg",91.2,50,750,"No","Yes"]
["POCES 02","Dredged sediment","Tributyltin ",null,"μg/kg",1.94,null,null,null,null,"*D. Lgs. 152/06: environmental quality standards in sediments expressed as the annual average   (SQA-MA) = 5 µg/kg SS * "]
["POCES 02","-0,125 +0,053 mm","Tributyltin ",null,"μg/kg","22,40 *"]
["POCES 02","-0,053 +0,020 mm","Tributyltin ",null,"μg/kg",1.32]
["POCES 02","-0,020 mm","Tributyltin ",null,"μg/kg",1.1100000000000001]
["BELLARIA 01","+0,25 mm","Granulometric Analysis",null,"%",1.47]
["BELLARIA 01","-0,25 +0,053 mm","Granulometric Analysis",null,"%",15.88]
["BELLARIA 01","-0,053 mm","Granulometric Analysis",null,"%",82.65]
["BELLARIA 01","Dredged sediment","Shepard classification",null,null,"Clayey silt"]
["BELLARIA 01","Dredged sediment","Nota classification",null,null,"Pelite"]
["BELLARIA 01","Dredged sediment","VS (%TS)",null,"%",8.2899999999999991]
["BELLARIA 01","Dredged sediment","TC (%TS)",null,"%",2.79]
["BELLARIA 01","Dredged sediment","IC (%TS)",null,"%",1.4]
["BELLARIA 01","Dredged sediment","TOC (%TS)",null,"%",1.39]
["BELLARIA 01","Dredged sediment","O2 consumption (1626 h)",null,"(mg O2/kg TS)",3971.28]
["BELLARIA 01","Dredged sediment","METALS","Zn ","mg/kg",160.08000000000001,150,1500,"No","Yes"]
["BELLARIA 01","Dredged sediment","METALS","Ni","mg/kg",59.805,120,500,"Yes","Yes"]
["BELLARIA 01","Dredged sediment","METALS","Cr","mg/kg",51.825000000000003,150,800,"Yes","Yes"]
["BELLARIA 01","Dredged sediment","METALS","Pb","mg/kg",25.91,100,1000,"Yes","Yes"]
["BELLARIA 01","Dredged sediment","METALS","As","μg/kg",15.15,20000,50000,"Yes","Yes"]
["BELLARIA 01","Dredged sediment","METALS","Cd","μg/kg",7.98,2000,15000]
["BELLARIA 01","-0,250 +0,053 mm","METALS","Zn ","mg/kg",191.745,150,1500,{"$f":"IF(F367<G367,\"Yes\",\"No\")","v":"No"},{"$f":"IF(F367<H367,\"Yes\",\"No\")","v":"Yes"}]
["BELLARIA 01","-0,250 +0,053 mm","METALS","Ni","mg/kg",65.930000000000007,120,500,"Yes","Yes"]
["BELLARIA 01","-0,250 +0,053 mm","METALS","Cr","mg/kg",51.93,150,800,"Yes","Yes"]
["BELLARIA 01","-0,250 +0,053 mm","METALS","Pb","mg/kg",47.945,100,1000,"Yes","Yes"]
["BELLARIA 01","-0,250 +0,053 mm","METALS","As","μg/kg",12.065,20000,50000,"Yes","Yes"]
["BELLARIA 01","-0,250 +0,053 mm","METALS","Cd","μg/kg","not detected",2000,15000]
["BELLARIA 01","-0,053 +0,020 mm","METALS","Zn ","mg/kg",215.185,150,1500,"No","Yes"]
["BELLARIA 01","-0,053 +0,020 mm","METALS","Ni","mg/kg",49.95,120,500,"Yes","Yes"]
["BELLARIA 01","-0,053 +0,020 mm","METALS","Cr","mg/kg",53.945,150,800,"Yes","Yes"]
["BELLARIA 01","-0,053 +0,020 mm","METALS","Pb","mg/kg",47.96,100,1000,"Yes","Yes"]
["BELLARIA 01","-0,053 +0,020 mm","METALS","As","μg/kg",13.545,20000,50000,"Yes","Yes"]
["BELLARIA 01","-0,053 +0,020 mm","METALS","Cd","μg/kg","not detected",2000,15000]
["BELLARIA 01","-0,020 mm","METALS","Zn ","mg/kg",132.815,150,1500,"Yes","Yes"]
["BELLARIA 01","-0,020 mm","METALS","Ni","mg/kg",71.894999999999996,120,500,"Yes","Yes"]
["BELLARIA 01","-0,020 mm","METALS","Cr","mg/kg",41.94,150,800,"Yes","Yes"]
["BELLARIA 01","-0,020 mm","METALS","Pb","mg/kg",37.945,100,1000,"Yes","Yes"]
["BELLARIA 01","-0,020 mm","METALS","As","μg/kg",15.535,20000,50000,"Yes","Yes"]
["BELLARIA 01","-0,020 mm","METALS","Cd","μg/kg","not detected",2000,15000]
["BELLARIA 01","Dredged sediment","PAH","naphthalene ","ng/g",68,"-","-","-","-"]
["BELLARIA 01","Dredged sediment","PAH","acenaphthene","ng/g",2,"-","-","-","-"]
["BELLARIA 01","Dredged sediment","PAH","fluorene","ng/g",6,"-","-","-","-"]
["BELLARIA 01","Dredged sediment","PAH","phenanthrene","ng/g",49,"-","-","-","-"]
["BELLARIA 01","Dredged sediment","PAH","anthracene","ng/g",5,"-","-","-","-"]
["BELLARIA 01","Dredged sediment","PAH","fluoranthene","ng/g",42,"-","-","-","-"]
["BELLARIA 01","Dredged sediment","PAH","pyrene","ng/g",45,5000,50000,{"$f":"IF(F391<G391,\"Yes\",\"No\")","v":"Yes"},{"$f":"IF(F391<H391,\"Yes\",\"No\")","v":"Yes"}]
["BELLARIA 01","Dredged sediment","PAH","benzo(a)anthracene","ng/g",14,500,10000,{"$f":"IF(F392<G392,\"Yes\",\"No\")","v":"Yes"},{"$f":"IF(F392<H392,\"Yes\",\"No\")","v":"Yes"}]
["BELLARIA 01","Dredged sediment","PAH","chrysene","ng/g",29,5000,50000,"Yes","Yes"]
["BELLARIA 01","Dredged sediment","PAH","benzo(b)fluoranthene","ng/g",48,500,10000,"Yes","Yes"]
["BELLARIA 01","Dredged sediment","PAH","benzo(k)fluoranthene","ng/g",9,500,10000,"Yes","Yes"]
["BELLARIA 01","Dredged sediment","PAH","benzo(a)pyrene","ng/g",20,100,10000,"Yes","Yes"]
["BELLARIA 01","Dredged sediment","PAH","dibenzo(a,h)anthracene","ng/g",2,100,10000,"Yes","Yes"]
["BELLARIA 01","Dredged sediment","PAH","benzo(g,h,i)perylene","ng/g",19,100,10000,"Yes","Yes"]
["BELLARIA 01","Dredged sediment","PAH","indeno(1,2,3,c,d)pyrene","ng/g",9,100,5000,"Yes","Yes"]
["BELLARIA 01","Dredged sediment","PAH","Sum PAH","ng/g",367,10000,100000,"Yes","Yes"]
["BELLARIA 01","-0,250 +0,053 mm","PAH","naphthalene ","ng/g",41,"-","-","-","-"]
["BELLARIA 01","-0,250 +0,053 mm","PAH","acenaphthene","ng/g",1,"-","-","-","-"]
["BELLARIA 01","-0,250 +0,053 mm","PAH","fluorene","ng/g",5,"-","-","-","-"]
["BELLARIA 01","-0,250 +0,053 mm","PAH","phenanthrene","ng/g",34,"-","-","-","-"]
["BELLARIA 01","-0,250 +0,053 mm","PAH","anthracene","ng/g",3,"-","-","-","-"]
["BELLARIA 01","-0,250 +0,053 mm","PAH","fluoranthene","ng/g",25,"-","-","-","-"]
["BELLARIA 01","-0,250 +0,053 mm","PAH","pyrene","ng/g",24,5000,50000,{"$f":"IF(F407<G407,\"Yes\",\"No\")","v":"Yes"},{"$f":"IF(F407<H407,\"Yes\",\"No\")","v":"Yes"}]
["BELLARIA 01","-0,250 +0,053 mm","PAH","benzo(a)anthracene","ng/g",8,500,10000,{"$f":"IF(F408<G408,\"Yes\",\"No\")","v":"Yes"},"Yes"]
["BELLARIA 01","-0,250 +0,053 mm","PAH","chrysene","ng/g",18,5000,50000,"Yes","Yes"]
["BELLARIA 01","-0,250 +0,053 mm","PAH","benzo(b)fluoranthene","ng/g",22,500,10000,"Yes","Yes"]
["BELLARIA 01","-0,250 +0,053 mm","PAH","benzo(k)fluoranthene","ng/g",6,500,10000,"Yes","Yes"]
["BELLARIA 01","-0,250 +0,053 mm","PAH","benzo(a)pyrene","ng/g",11,100,10000,"Yes","Yes"]
["BELLARIA 01","-0,250 +0,053 mm","PAH","dibenzo(a,h)anthracene","ng/g",1,100,10000,"Yes","Yes"]
["BELLARIA 01","-0,250 +0,053 mm","PAH","benzo(g,h,i)perylene","ng/g",11,100,10000,"Yes","Yes"]
["BELLARIA 01","-0,250 +0,053 mm","PAH","indeno(1,2,3,c,d)pyrene","ng/g",6,100,5000,"Yes","Yes"]
["BELLARIA 01","-0,250 +0,053 mm","PAH","Sum PAH","ng/g",215,10000,100000,"Yes","Yes"]
["BELLARIA 01","-0,053 +0,020 mm","PAH","naphthalene ","ng/g",67,"-","-","-","-"]
["BELLARIA 01","-0,053 +0,020 mm","PAH","acenaphthene","ng/g",1,"-","-","-","-"]
["BELLARIA 01","-0,053 +0,020 mm","PAH","fluorene","ng/g",7,"-","-","-","-"]
["BELLARIA 01","-0,053 +0,020 mm","PAH","phenanthrene","ng/g",45,"-","-","-","-"]
["BELLARIA 01","-0,053 +0,020 mm","PAH","anthracene","ng/g",2,"-","-","-","-"]
["BELLARIA 01","-0,053 +0,020 mm","PAH","fluoranthene","ng/g",18,"-","-","-","-"]
["BELLARIA 01","-0,053 +0,020 mm","PAH","pyrene","ng/g",23,5000,50000,{"$f":"IF(F423<G423,\"Yes\",\"No\")","v":"Yes"},{"$f":"IF(F423<H423,\"Yes\",\"No\")","v":"Yes"}]
["BELLARIA 01","-0,053 +0,020 mm","PAH","benzo(a)anthracene","ng/g",5,500,10000,{"$f":"IF(F424<G424,\"Yes\",\"No\")","v":"Yes"},"Yes"]
["BELLARIA 01","-0,053 +0,020 mm","PAH","chrysene","ng/g",19,5000,50000,"Yes","Yes"]
["BELLARIA 01","-0,053 +0,020 mm","PAH","benzo(b)fluoranthene","ng/g",39,500,10000,"Yes","Yes"]
["BELLARIA 01","-0,053 +0,020 mm","PAH","benzo(k)fluoranthene","ng/g",4,500,10000,"Yes","Yes"]
["BELLARIA 01","-0,053 +0,020 mm","PAH","benzo(a)pyrene","ng/g",10,100,10000,"Yes","Yes"]
["BELLARIA 01","-0,053 +0,020 mm","PAH","dibenzo(a,h)anthracene","ng/g",1,100,10000,"Yes","Yes"]
["BELLARIA 01","-0,053 +0,020 mm","PAH","benzo(g,h,i)perylene","ng/g",12,100,10000,"Yes","Yes"]
["BELLARIA 01","-0,053 +0,020 mm","PAH","indeno(1,2,3,c,d)pyrene","ng/g",5,100,5000,"Yes","Yes"]
["BELLARIA 01","-0,053 +0,020 mm","PAH","Sum PAH","ng/g",259,10000,100000,"Yes","Yes"]
["BELLARIA 01","-0,020 mm","PAH","naphthalene ","ng/g",210,"-","-","-","-"]
["BELLARIA 01","-0,020 mm","PAH","acenaphthene","ng/g",1,"-","-","-","-"]
["BELLARIA 01","-0,020 mm","PAH","fluorene","ng/g",5,"-","-","-","-"]
["BELLARIA 01","-0,020 mm","PAH","phenanthrene","ng/g",42,"-","-","-","-"]
["BELLARIA 01","-0,020 mm","PAH","anthracene","ng/g",1,"-","-","-","-"]
["BELLARIA 01","-0,020 mm","PAH","fluoranthene","ng/g",14,"-","-","-","-"]
["BELLARIA 01","-0,020 mm","PAH","pyrene","ng/g",17,5000,50000,{"$f":"IF(F439<G439,\"Yes\",\"No\")","v":"Yes"},{"$f":"IF(F439<H439,\"Yes\",\"No\")","v":"Yes"}]
["BELLARIA 01","-0,020 mm","PAH","benzo(a)anthracene","ng/g",3,500,10000,{"$f":"IF(F440<G440,\"Yes\",\"No\")","v":"Yes"},"Yes"]
["BELLARIA 01","-0,020 mm","PAH","chrysene","ng/g",15,5000,50000,"Yes","Yes"]
["BELLARIA 01","-0,020 mm","PAH","benzo(b)fluoranthene","ng/g",39,500,10000,"Yes","Yes"]
["BELLARIA 01","-0,020 mm","PAH","benzo(k)fluoranthene","ng/g",2,500,10000,"Yes","Yes"]
["BELLARIA 01","-0,020 mm","PAH","benzo(a)pyrene","ng/g",5,100,10000,"Yes","Yes"]
["BELLARIA 01","-0,020 mm","PAH","dibenzo(a,h)anthracene","ng/g",1,100,10000,"Yes","Yes"]
["BELLARIA 01","-0,020 mm","PAH","benzo(g,h,i)perylene","ng/g",14,100,10000,"Yes","Yes"]
["BELLARIA 01","-0,020 mm","PAH","indeno(1,2,3,c,d)pyrene","ng/g",3,100,5000,"Yes","Yes"]
["BELLARIA 01","-0,020 mm","PAH","Sum PAH","ng/g",371,10000,100000,"Yes","Yes"]
["BELLARIA 01","Dredged sediment","PCB","PCB 28","ng/g",0.1,"-","-","-","-"]
["BELLARIA 01","Dredged sediment","PCB","PCB 52","ng/g",0.2,"-","-","-","-"]
["BELLARIA 01","Dredged sediment","PCB","PCB 101","ng/g",0.3,"-","-","-","-"]
["BELLARIA 01","Dredged sediment","PCB","PCB 81","ng/g","<LOQ","-","-","-","-"]
["BELLARIA 01","Dredged sediment","PCB","PCB 77","ng/g","<LOQ","-","-","-","-"]
["BELLARIA 01","Dredged sediment","PCB","PCB123","ng/g","<LOQ","-","-","-","-"]
["BELLARIA 01","Dredged sediment","PCB","PCB 118","ng/g",0.2,"-","-","-","-"]
["BELLARIA 01","Dredged sediment","PCB","PCB 114","ng/g","<LOQ","-","-","-","-"]
["BELLARIA 01","Dredged sediment","PCB","PCB 153","ng/g",0.4,"-","-","-","-"]
["BELLARIA 01","Dredged sediment","PCB","PCB 105","ng/g",0.1,"-","-","-","-"]
["BELLARIA 01","Dredged sediment","PCB","PCB 138","ng/g",0.3,"-","-","-","-"]
["BELLARIA 01","Dredged sediment","PCB","PCB 126","ng/g","<LOQ","-","-","-","-"]
["BELLARIA 01","Dredged sediment","PCB","PCB 128","ng/g","<LOQ","-","-","-","-"]
["BELLARIA 01","Dredged sediment","PCB","PCB167","ng/g","<LOQ","-","-","-","-"]
["BELLARIA 01","Dredged sediment","PCB","PCB 156","ng/g","<LOQ","-","-","-","-"]
["BELLARIA 01","Dredged sediment","PCB","PCB 157","ng/g","<LOQ","-","-","-","-"]
["BELLARIA 01","Dredged sediment","PCB","PCB 180","ng/g",0.2,"-","-","-","-"]
["BELLARIA 01","Dredged sediment","PCB","PCB 170","ng/g",0.138923909935974,"-","-","-","-"]
["BELLARIA 01","Dredged sediment","PCB","PCB 169","ng/g","<LOQ","-","-","-","-"]
["BELLARIA 01","Dredged sediment","PCB","PCB 189","ng/g","<LOQ","-","-","-","-"]
["BELLARIA 01","Dredged sediment","PCB","PCB 209","ng/g",0.1,"-","-","-","-"]
["BELLARIA 01","Dredged sediment","PCB","Sum PCB","ng/g",1.9,60,5000,{"$f":"IF(F470<G470,\"Yes\",\"No\")","v":"Yes"},{"$f":"IF(F470<H470,\"Yes\",\"No\")","v":"Yes"}]
["BELLARIA 01","Dredged sediment","PCB","CB 110","ng/g",0.2,"-","-","-","-"]
["BELLARIA 01","-0,250 +0,053 mm","PCB","PCB 28","ng/g",0.1,"-","-","-","-"]
["BELLARIA 01","-0,250 +0,053 mm","PCB","PCB 52","ng/g",0.3,"-","-","-","-"]
["BELLARIA 01","-0,250 +0,053 mm","PCB","PCB 101","ng/g",0.4,"-","-","-","-"]
["BELLARIA 01","-0,250 +0,053 mm","PCB","PCB 81","ng/g","<LOQ","-","-","-","-"]
["BELLARIA 01","-0,250 +0,053 mm","PCB","PCB 77","ng/g","<LOQ","-","-","-","-"]
["BELLARIA 01","-0,250 +0,053 mm","PCB","PCB123","ng/g","<LOQ","-","-","-","-"]
["BELLARIA 01","-0,250 +0,053 mm","PCB","PCB 118","ng/g",0.2,"-","-","-","-"]
["BELLARIA 01","-0,250 +0,053 mm","PCB","PCB 114","ng/g","<LOQ","-","-","-","-"]
["BELLARIA 01","-0,250 +0,053 mm","PCB","PCB 153","ng/g",0.5,"-","-","-","-"]
["BELLARIA 01","-0,250 +0,053 mm","PCB","PCB 105","ng/g",0.1,"-","-","-","-"]
["BELLARIA 01","-0,250 +0,053 mm","PCB","PCB 138","ng/g",0.3,"-","-","-","-"]
["BELLARIA 01","-0,250 +0,053 mm","PCB","PCB 126","ng/g","<LOQ","-","-","-","-"]
["BELLARIA 01","-0,250 +0,053 mm","PCB","PCB 128","ng/g","<LOQ","-","-","-","-"]
["BELLARIA 01","-0,250 +0,053 mm","PCB","PCB167","ng/g","<LOQ","-","-","-","-"]
["BELLARIA 01","-0,250 +0,053 mm","PCB","PCB 156","ng/g","<LOQ","-","-","-","-"]
["BELLARIA 01","-0,250 +0,053 mm","PCB","PCB 157","ng/g","<LOQ","-","-","-","-"]
["BELLARIA 01","-0,250 +0,053 mm","PCB","PCB 180","ng/g",0.16468623034177701,"-","-","-","-"]
["BELLARIA 01","-0,250 +0,053 mm","PCB","PCB 170","ng/g",0.1,"-","-","-","-"]
["BELLARIA 01","-0,250 +0,053 mm","PCB","PCB 169","ng/g","<LOQ","-","-","-","-"]
["BELLARIA 01","-0,250 +0,053 mm","PCB","PCB 189","ng/g","<LOQ","-","-","-","-"]
["BELLARIA 01","-0,250 +0,053 mm","PCB","PCB 209","ng/g",0.1,"-","-","-","-"]
["BELLARIA 01","-0,250 +0,053 mm","PCB","Sum PCB","ng/g",2.2999999999999998,60,5000,{"$f":"IF(F493<G493,\"Yes\",\"No\")","v":"Yes"},{"$f":"IF(F493<H493,\"Yes\",\"No\")","v":"Yes"}]
["BELLARIA 01","-0,250 +0,053 mm","PCB","CB 110","ng/g",0.3,"-","-","-","-"]
["BELLARIA 01","-0,053 +0,020 mm","PCB","PCB 28","ng/g",0.2,"-","-","-","-"]
["BELLARIA 01","-0,053 +0,020 mm","PCB","PCB 52","ng/g",0.3,"-","-","-","-"]
["BELLARIA 01","-0,053 +0,020 mm","PCB","PCB 101","ng/g",0.4,"-","-","-","-"]
["BELLARIA 01","-0,053 +0,020 mm","PCB","PCB 81","ng/g","<LOQ","-","-","-","-"]
["BELLARIA 01","-0,053 +0,020 mm","PCB","PCB 77","ng/g","<LOQ","-","-","-","-"]
["BELLARIA 01","-0,053 +0,020 mm","PCB","PCB123","ng/g","<LOQ","-","-","-","-"]
["BELLARIA 01","-0,053 +0,020 mm","PCB","PCB 118","ng/g",0.2,"-","-","-","-"]
["BELLARIA 01","-0,053 +0,020 mm","PCB","PCB 114","ng/g","<LOQ","-","-","-","-"]
["BELLARIA 01","-0,053 +0,020 mm","PCB","PCB 153","ng/g",0.6,"-","-","-","-"]
["BELLARIA 01","-0,053 +0,020 mm","PCB","PCB 105","ng/g",0.1,"-","-","-","-"]
["BELLARIA 01","-0,053 +0,020 mm","PCB","PCB 138","ng/g",0.4,"-","-","-","-"]
["BELLARIA 01","-0,053 +0,020 mm","PCB","PCB 126","ng/g","<LOQ","-","-","-","-"]
["BELLARIA 01","-0,053 +0,020 mm","PCB","PCB 128","ng/g","<LOQ","-","-","-","-"]
["BELLARIA 01","-0,053 +0,020 mm","PCB","PCB167","ng/g","<LOQ","-","-","-","-"]
["BELLARIA 01","-0,053 +0,020 mm","PCB","PCB 156","ng/g","<LOQ","-","-","-","-"]
["BELLARIA 01","-0,053 +0,020 mm","PCB","PCB 157","ng/g","<LOQ","-","-","-","-"]
["BELLARIA 01","-0,053 +0,020 mm","PCB","PCB 180","ng/g",0.16468623034177701,"-","-","-","-"]
["BELLARIA 01","-0,053 +0,020 mm","PCB","PCB 170","ng/g",0.1,"-","-","-","-"]
["BELLARIA 01","-0,053 +0,020 mm","PCB","PCB 169","ng/g","<LOQ","-","-","-","-"]
["BELLARIA 01","-0,053 +0,020 mm","PCB","PCB 189","ng/g","<LOQ","-","-","-","-"]
["BELLARIA 01","-0,053 +0,020 mm","PCB","PCB 209","ng/g",0.1,"-","-","-","-"]
["BELLARIA 01","-0,053 +0,020 mm","PCB","Sum PCB","ng/g",2.5,60,5000,{"$f":"IF(F516<G516,\"Yes\",\"No\")","v":"Yes"},{"$f":"IF(F516<H516,\"Yes\",\"No\")","v":"Yes"}]
["BELLARIA 01","-0,053 +0,020 mm","PCB","CB 110","ng/g",0.3,"-","-","-","-"]
["BELLARIA 01","-0,020 mm","PCB","PCB 28","ng/g",0.2,"-","-","-","-"]
["BELLARIA 01","-0,020 mm","PCB","PCB 52","ng/g",0.2,"-","-","-","-"]
["BELLARIA 01","-0,020 mm","PCB","PCB 101","ng/g",0.4,"-","-","-","-"]
["BELLARIA 01","-0,020 mm","PCB","PCB 81","ng/g","<LOQ","-","-","-","-"]
["BELLARIA 01","-0,020 mm","PCB","PCB 77","ng/g","<LOQ","-","-","-","-"]
["BELLARIA 01","-0,020 mm","PCB","PCB123","ng/g","<LOQ","-","-","-","-"]
["BELLARIA 01","-0,020 mm","PCB","PCB 118","ng/g",0.3,"-","-","-","-"]
["BELLARIA 01","-0,020 mm","PCB","PCB 114","ng/g","<LOQ","-","-","-","-"]
["BELLARIA 01","-0,020 mm","PCB","PCB 153","ng/g",0.8,"-","-","-","-"]
["BELLARIA 01","-0,020 mm","PCB","PCB 105","ng/g",0.1,"-","-","-","-"]
["BELLARIA 01","-0,020 mm","PCB","PCB 138","ng/g",0.5,"-","-","-","-"]
["BELLARIA 01","-0,020 mm","PCB","PCB 126","ng/g","<LOQ","-","-","-","-"]
["BELLARIA 01","-0,020 mm","PCB","PCB 128","ng/g",0.1,"-","-","-","-"]
["BELLARIA 01","-0,020 mm","PCB","PCB167","ng/g","<LOQ","-","-","-","-"]
["BELLARIA 01","-0,020 mm","PCB","PCB 156","ng/g","<LOQ","-","-","-","-"]
["BELLARIA 01","-0,020 mm","PCB","PCB 157","ng/g","<LOQ","-","-","-","-"]
["BELLARIA 01","-0,020 mm","PCB","PCB 180","ng/g",0.4,"-","-","-","-"]
["BELLARIA 01","-0,020 mm","PCB","PCB 170","ng/g",0.1,"-","-","-","-"]
["BELLARIA 01","-0,020 mm","PCB","PCB 169","ng/g","<LOQ","-","-","-","-"]
["BELLARIA 01","-0,020 mm","PCB","PCB 189","ng/g","<LOQ","-","-","-","-"]
["BELLARIA 01","-0,020 mm","PCB","PCB 209","ng/g",0.1,"-","-","-","-"]
["BELLARIA 01","-0,020 mm","PCB","Sum PCB","ng/g",3.3,60,5000,{"$f":"IF(F539<G539,\"Yes\",\"No\")","v":"Yes"},{"$f":"IF(F539<H539,\"Yes\",\"No\")","v":"Yes"}]
["BELLARIA 01","-0,020 mm","PCB","CB 110","ng/g",0.4,"-","-","-","-"]
["BELLARIA 01","Dredged sediment","Hydrocarbons (C > 12 mg/kg)",null,"mg/kg",19.670000000000002,50,750,{"$f":"IF(F541<G541,\"Yes\",\"No\")","v":"Yes"},{"$f":"IF(F541<H541,\"Yes\",\"No\")","v":"Yes"}]
["BELLARIA 01","-0,250 +0,053 mm","Hydrocarbons (C > 12 mg/kg)",null,"mg/kg",25.49,50,750,"Yes","Yes"]
["BELLARIA 01","-0,053 +0,020 mm","Hydrocarbons (C > 12 mg/kg)",null,"mg/kg",32.32,50,750,"Yes","Yes"]
["BELLARIA 01","-0,020 mm","Hydrocarbons (C > 12 mg/kg)",null,"mg/kg",36.11,50,750,"Yes","Yes"]
["BELLARIA 01","Dredged sediment","Tributyltin ",null,"μg/kg",0.54]
["BELLARIA 01","-0,250 +0,053 mm","Tributyltin ",null,"μg/kg",1]
["BELLARIA 01","-0,053 +0,020 mm","Tributyltin ",null,"μg/kg",0.53]
["BELLARIA 01","-0,020 mm","Tributyltin ",null,"μg/kg",0.56000000000000005]
["BELLARIA 02","+0,25 mm","Granulometric Analysis",null,"%",1.21]
["BELLARIA 02","-0,25 +0,053 mm","Granulometric Analysis",null,"%",7.93]
["BELLARIA 02","-0,053 mm","Granulometric Analysis",null,"%",90.86]
["BELLARIA 02","Dredged sediment","Shepard classification",null,null,"Clayey silt"]
["BELLARIA 02","Dredged sediment","Nota classification",null,null,"Pelite"]
["BELLARIA 02","Dredged sediment","VS (%TS)",null,"%",10.67]
["BELLARIA 02","Dredged sediment","TC (%TS)",null,"%",2.75]
["BELLARIA 02","Dredged sediment","IC (%TS)",null,"%",1.23]
["BELLARIA 02","Dredged sediment","TOC (%TS)",null,"%",1.52]
["BELLARIA 02","Dredged sediment","O2 consumption (1626 h)",null,"(mg O2/kg TS)",3369.2]
["BELLARIA 02","Dredged sediment","METALS","Zn ","mg/kg",136.61000000000001,150,1500,"Yes","Yes"]
["BELLARIA 02","Dredged sediment","METALS","Ni","mg/kg",69.900000000000006,120,500,"Yes","Yes"]
["BELLARIA 02","Dredged sediment","METALS","Cr","mg/kg",41.935000000000002,150,800,"Yes","Yes"]
["BELLARIA 02","Dredged sediment","METALS","Pb","mg/kg",29.975000000000001,100,1000,"Yes","Yes"]
["BELLARIA 02","Dredged sediment","METALS","As","μg/kg",13.105,20000,50000,"Yes","Yes"]
["BELLARIA 02","Dredged sediment","METALS","Cd","μg/kg","not detected",2000,15000]
["BELLARIA 02","-0,125 +0,053 mm","METALS","Zn ","mg/kg",105.905,150,1500,{"$f":"IF(F565<G565,\"Yes\",\"No\")","v":"Yes"},{"$f":"IF(F565<H565,\"Yes\",\"No\")","v":"Yes"}]
["BELLARIA 02","-0,125 +0,053 mm","METALS","Ni","mg/kg",57.95,120,500,"Yes","Yes"]
["BELLARIA 02","-0,125 +0,053 mm","METALS","Cr","mg/kg",43.96,150,800,"Yes","Yes"]
["BELLARIA 02","-0,125 +0,053 mm","METALS","Pb","mg/kg",59.945,100,1000,"Yes","Yes"]
["BELLARIA 02","-0,125 +0,053 mm","METALS","As","μg/kg",15.145,20000,50000,"Yes","Yes"]
["BELLARIA 02","-0,125 +0,053 mm","METALS","Cd","μg/kg","not detected",2000,15000]
["BELLARIA 02","-0,053 +0,020 mm","METALS","Zn ","mg/kg",118.255,150,1500,"Yes","Yes"]
["BELLARIA 02","-0,053 +0,020 mm","METALS","Ni","mg/kg",61.924999999999997,120,500,"Yes","Yes"]
["BELLARIA 02","-0,053 +0,020 mm","METALS","Cr","mg/kg",43.945,150,800,"Yes","Yes"]
["BELLARIA 02","-0,053 +0,020 mm","METALS","Pb","mg/kg",51.94,100,1000,"Yes","Yes"]
["BELLARIA 02","-0,053 +0,020 mm","METALS","As","μg/kg",13.345000000000001,20000,50000,"Yes","Yes"]
["BELLARIA 02","-0,053 +0,020 mm","METALS","Cd","μg/kg","not detected",2000,15000]
["BELLARIA 02","-0,020 mm","METALS","Zn ","mg/kg",132.535,150,1500,"Yes","Yes"]
["BELLARIA 02","-0,020 mm","METALS","Ni","mg/kg",71.86,120,500,"Yes","Yes"]
["BELLARIA 02","-0,020 mm","METALS","Cr","mg/kg",45.91,150,800,"Yes","Yes"]
["BELLARIA 02","-0,020 mm","METALS","Pb","mg/kg",33.93,100,1000,"Yes","Yes"]
["BELLARIA 02","-0,020 mm","METALS","As","μg/kg",14.21,20000,50000,"Yes","Yes"]
["BELLARIA 02","-0,020 mm","METALS","Cd","μg/kg","not detected",2000,15000]
["BELLARIA 02","Dredged sediment","PAH","naphthalene ","ng/g",11,"-","-","-","-"]
["BELLARIA 02","Dredged sediment","PAH","acenaphthene","ng/g",1,"-","-","-","-"]
["BELLARIA 02","Dredged sediment","PAH","fluorene","ng/g",7,"-","-","-","-"]
["BELLARIA 02","Dredged sediment","PAH","phenanthrene","ng/g",42,"-","-","-","-"]
["BELLARIA 02","Dredged sediment","PAH","anthracene","ng/g",1,"-","-","-","-"]
["BELLARIA 02","Dredged sediment","PAH","fluoranthene","ng/g",21,"-","-","-","-"]
["BELLARIA 02","Dredged sediment","PAH","pyrene","ng/g",21,5000,50000,{"$f":"IF(F589<G589,\"Yes\",\"No\")","v":"Yes"},{"$f":"IF(F589<H589,\"Yes\",\"No\")","v":"Yes"}]
["BELLARIA 02","Dredged sediment","PAH","benzo(a)anthracene","ng/g",4,500,10000,{"$f":"IF(F590<G590,\"Yes\",\"No\")","v":"Yes"},{"$f":"IF(F590<H590,\"Yes\",\"No\")","v":"Yes"}]
["BELLARIA 02","Dredged sediment","PAH","chrysene","ng/g",25,5000,50000,"Yes","Yes"]
["BELLARIA 02","Dredged sediment","PAH","benzo(b)fluoranthene","ng/g",41,500,10000,"Yes","Yes"]
["BELLARIA 02","Dredged sediment","PAH","benzo(k)fluoranthene","ng/g",4,500,10000,"Yes","Yes"]
["BELLARIA 02","Dredged sediment","PAH","benzo(a)pyrene","ng/g",9,100,10000,"Yes","Yes"]
["BELLARIA 02","Dredged sediment","PAH","dibenzo(a,h)anthracene","ng/g",2,100,10000,"Yes","Yes"]
["BELLARIA 02","Dredged sediment","PAH","benzo(g,h,i)perylene","ng/g",16,100,10000,"Yes","Yes"]
["BELLARIA 02","Dredged sediment","PAH","indeno(1,2,3,c,d)pyrene","ng/g",5,100,5000,"Yes","Yes"]
["BELLARIA 02","Dredged sediment","PAH","Sum PAH","ng/g",212,10000,100000,"Yes","Yes"]
["BELLARIA 02","-0,053 +0,020 mm","PAH","naphthalene ","ng/g",14,"-","-","-","-"]
["BELLARIA 02","-0,053 +0,020 mm","PAH","acenaphthene","ng/g",1,"-","-","-","-"]
["BELLARIA 02","-0,053 +0,020 mm","PAH","fluorene","ng/g",7,"-","-","-","-"]
["BELLARIA 02","-0,053 +0,020 mm","PAH","phenanthrene","ng/g",53,"-","-","-","-"]
["BELLARIA 02","-0,053 +0,020 mm","PAH","anthracene","ng/g",2,"-","-","-","-"]
["BELLARIA 02","-0,053 +0,020 mm","PAH","fluoranthene","ng/g",22,"-","-","-","-"]
["BELLARIA 02","-0,053 +0,020 mm","PAH","pyrene","ng/g",30,5000,50000,{"$f":"IF(F605<G605,\"Yes\",\"No\")","v":"Yes"},{"$f":"IF(F605<H605,\"Yes\",\"No\")","v":"Yes"}]
["BELLARIA 02","-0,053 +0,020 mm","PAH","benzo(a)anthracene","ng/g",6,500,10000,{"$f":"IF(F606<G606,\"Yes\",\"No\")","v":"Yes"},"Yes"]
["BELLARIA 02","-0,053 +0,020 mm","PAH","chrysene","ng/g",26,5000,50000,"Yes","Yes"]
["BELLARIA 02","-0,053 +0,020 mm","PAH","benzo(b)fluoranthene","ng/g",46,500,10000,"Yes","Yes"]
["BELLARIA 02","-0,053 +0,020 mm","PAH","benzo(k)fluoranthene","ng/g",5,500,10000,"Yes","Yes"]
["BELLARIA 02","-0,053 +0,020 mm","PAH","benzo(a)pyrene","ng/g",12,100,10000,"Yes","Yes"]
["BELLARIA 02","-0,053 +0,020 mm","PAH","dibenzo(a,h)anthracene","ng/g",2,100,10000,"Yes","Yes"]
["BELLARIA 02","-0,053 +0,020 mm","PAH","benzo(g,h,i)perylene","ng/g",20,100,10000,"Yes","Yes"]
["BELLARIA 02","-0,053 +0,020 mm","PAH","indeno(1,2,3,c,d)pyrene","ng/g",7,100,5000,"Yes","Yes"]
["BELLARIA 02","-0,053 +0,020 mm","PAH","Sum PAH","ng/g",254,10000,100000,"Yes","Yes"]
["BELLARIA 02","-0,020 mm","PAH","naphthalene ","ng/g",11,"-","-","-","-"]
["BELLARIA 02","-0,020 mm","PAH","acenaphthene","ng/g",1,"-","-","-","-"]
["BELLARIA 02","-0,020 mm","PAH","fluorene","ng/g",7,"-","-","-","-"]
["BELLARIA 02","-0,020 mm","PAH","phenanthrene","ng/g",42,"-","-","-","-"]
["BELLARIA 02","-0,020 mm","PAH","anthracene","ng/g",1,"-","-","-","-"]
["BELLARIA 02","-0,020 mm","PAH","fluoranthene","ng/g",21,"-","-","-","-"]
["BELLARIA 02","-0,020 mm","PAH","pyrene","ng/g",21,5000,50000,{"$f":"IF(F621<G621,\"Yes\",\"No\")","v":"Yes"},{"$f":"IF(F621<H621,\"Yes\",\"No\")","v":"Yes"}]
["BELLARIA 02","-0,020 mm","PAH","benzo(a)anthracene","ng/g",4,500,10000,{"$f":"IF(F622<G622,\"Yes\",\"No\")","v":"Yes"},"Yes"]
["BELLARIA 02","-0,020 mm","PAH","chrysene","ng/g",25,5000,50000,"Yes","Yes"]
["BELLARIA 02","-0,020 mm","PAH","benzo(b)fluoranthene","ng/g",41,500,10000,"Yes","Yes"]
["BELLARIA 02","-0,020 mm","PAH","benzo(k)fluoranthene","ng/g",4,500,10000,"Yes","Yes"]
["BELLARIA 02","-0,020 mm","PAH","benzo(a)pyrene","ng/g",9,100,10000,"Yes","Yes"]
["BELLARIA 02","-0,020 mm","PAH","dibenzo(a,h)anthracene","ng/g",2,100,10000,"Yes","Yes"]
["BELLARIA 02","-0,020 mm","PAH","benzo(g,h,i)perylene","ng/g",16,100,10000,"Yes","Yes"]
["BELLARIA 02","-0,020 mm","PAH","indeno(1,2,3,c,d)pyrene","ng/g",5,100,5000,"Yes","Yes"]
["BELLARIA 02","-0,020 mm","PAH","Sum PAH","ng/g",212,10000,100000,"Yes","Yes"]
["BELLARIA 02","Dredged sediment","PCB","PCB 28","ng/g",0.2,"-","-","-","-"]
["BELLARIA 02","Dredged sediment","PCB","PCB 52","ng/g",0.2,"-","-","-","-"]
["BELLARIA 02","Dredged sediment","PCB","PCB 101","ng/g",0.4,"-","-","-","-"]
["BELLARIA 02","Dredged sediment","PCB","PCB 81","ng/g","<LOQ","-","-","-","-"]
["BELLARIA 02","Dredged sediment","PCB","PCB 77","ng/g","<LOQ","-","-","-","-"]
["BELLARIA 02","Dredged sediment","PCB","PCB123","ng/g","<LOQ","-","-","-","-"]
["BELLARIA 02","Dredged sediment","PCB","PCB 118","ng/g",0.3,"-","-","-","-"]
["BELLARIA 02","Dredged sediment","PCB","PCB 114","ng/g","<LOQ","-","-","-","-"]
["BELLARIA 02","Dredged sediment","PCB","PCB 153","ng/g",0.6,"-","-","-","-"]
["BELLARIA 02","Dredged sediment","PCB","PCB 105","ng/g",0.1,"-","-","-","-"]
["BELLARIA 02","Dredged sediment","PCB","PCB 138","ng/g",0.4,"-","-","-","-"]
["BELLARIA 02","Dredged sediment","PCB","PCB 126","ng/g","<LOQ","-","-","-","-"]
["BELLARIA 02","Dredged sediment","PCB","PCB 128","ng/g","<LOQ","-","-","-","-"]
["BELLARIA 02","Dredged sediment","PCB","PCB167","ng/g","<LOQ","-","-","-","-"]
["BELLARIA 02","Dredged sediment","PCB","PCB 156","ng/g","<LOQ","-","-","-","-"]
["BELLARIA 02","Dredged sediment","PCB","PCB 157","ng/g","<LOQ","-","-","-","-"]
["BELLARIA 02","Dredged sediment","PCB","PCB 180","ng/g",0.2,"-","-","-","-"]
["BELLARIA 02","Dredged sediment","PCB","PCB 170","ng/g",0.138923909935974,"-","-","-","-"]
["BELLARIA 02","Dredged sediment","PCB","PCB 169","ng/g","<LOQ","-","-","-","-"]
["BELLARIA 02","Dredged sediment","PCB","PCB 189","ng/g","<LOQ","-","-","-","-"]
["BELLARIA 02","Dredged sediment","PCB","PCB 209","ng/g",0.1,"-","-","-","-"]
["BELLARIA 02","Dredged sediment","PCB","Sum PCB","ng/g",2.6,60,5000,{"$f":"IF(F652<G652,\"Yes\",\"No\")","v":"Yes"},{"$f":"IF(F652<H652,\"Yes\",\"No\")","v":"Yes"}]
["BELLARIA 02","Dredged sediment","PCB","CB 110","ng/g",0.3,"-","-","-","-"]
["BELLARIA 02","-0,053 +0,020 mm","PCB","PCB 28","ng/g",0.2,"-","-","-","-"]
["BELLARIA 02","-0,053 +0,020 mm","PCB","PCB 52","ng/g",0.2,"-","-","-","-"]
["BELLARIA 02","-0,053 +0,020 mm","PCB","PCB 101","ng/g",0.4,"-","-","-","-"]
["BELLARIA 02","-0,053 +0,020 mm","PCB","PCB 81","ng/g","<LOQ","-","-","-","-"]
["BELLARIA 02","-0,053 +0,020 mm","PCB","PCB 77","ng/g","<LOQ","-","-","-","-"]
["BELLARIA 02","-0,053 +0,020 mm","PCB","PCB123","ng/g","<LOQ","-","-","-","-"]
["BELLARIA 02","-0,053 +0,020 mm","PCB","PCB 118","ng/g",0.2,"-","-","-","-"]
["BELLARIA 02","-0,053 +0,020 mm","PCB","PCB 114","ng/g","<LOQ","-","-","-","-"]
["BELLARIA 02","-0,053 +0,020 mm","PCB","PCB 153","ng/g",0.8,"-","-","-","-"]
["BELLARIA 02","-0,053 +0,020 mm","PCB","PCB 105","ng/g",0.1,"-","-","-","-"]
["BELLARIA 02","-0,053 +0,020 mm","PCB","PCB 138","ng/g",0.5,"-","-","-","-"]
["BELLARIA 02","-0,053 +0,020 mm","PCB","PCB 126","ng/g","<LOQ","-","-","-","-"]
["BELLARIA 02","-0,053 +0,020 mm","PCB","PCB 128","ng/g",0.1,"-","-","-","-"]
["BELLARIA 02","-0,053 +0,020 mm","PCB","PCB167","ng/g","<LOQ","-","-","-","-"]
["BELLARIA 02","-0,053 +0,020 mm","PCB","PCB 156","ng/g","<LOQ","-","-","-","-"]
["BELLARIA 02","-0,053 +0,020 mm","PCB","PCB 157","ng/g","<LOQ","-","-","-","-"]
["BELLARIA 02","-0,053 +0,020 mm","PCB","PCB 180","ng/g",0.5,"-","-","-","-"]
["BELLARIA 02","-0,053 +0,020 mm","PCB","PCB 170","ng/g",0.2,"-","-","-","-"]
["BELLARIA 02","-0,053 +0,020 mm","PCB","PCB 169","ng/g","<LOQ","-","-","-","-"]
["BELLARIA 02","-0,053 +0,020 mm","PCB","PCB 189","ng/g","<LOQ","-","-","-","-"]
["BELLARIA 02","-0,053 +0,020 mm","PCB","PCB 209","ng/g",0.1,"-","-","-","-"]
["BELLARIA 02","-0,053 +0,020 mm","PCB","Sum PCB","ng/g",3.3,60,5000,{"$f":"IF(F675<G675,\"Yes\",\"No\")","v":"Yes"},{"$f":"IF(F675<H675,\"Yes\",\"No\")","v":"Yes"}]
["BELLARIA 02","-0,053 +0,020 mm","PCB","CB 110","ng/g",0.3,"-","-","-","-"]
["BELLARIA 02","-0,020 mm","PCB","PCB 28","ng/g",0.2,"-","-","-","-"]
["BELLARIA 02","-0,020 mm","PCB","PCB 52","ng/g",0.3,"-","-","-","-"]
["BELLARIA 02","-0,020 mm","PCB","PCB 101","ng/g",0.4,"-","-","-","-"]
["BELLARIA 02","-0,020 mm","PCB","PCB 81","ng/g","<LOQ","-","-","-","-"]
["BELLARIA 02","-0,020 mm","PCB","PCB 77","ng/g","<LOQ","-","-","-","-"]
["BELLARIA 02","-0,020 mm","PCB","PCB123","ng/g","<LOQ","-","-","-","-"]
["BELLARIA 02","-0,020 mm","PCB","PCB 118","ng/g",0.3,"-","-","-","-"]
["BELLARIA 02","-0,020 mm","PCB","PCB 114","ng/g","<LOQ","-","-","-","-"]
["BELLARIA 02","-0,020 mm","PCB","PCB 153","ng/g",0.9,"-","-","-","-"]
["BELLARIA 02","-0,020 mm","PCB","PCB 105","ng/g",0.1,"-","-","-","-"]
["BELLARIA 02","-0,020 mm","PCB","PCB 138","ng/g",0.6,"-","-","-","-"]
["BELLARIA 02","-0,020 mm","PCB","PCB 126","ng/g","<LOQ","-","-","-","-"]
["BELLARIA 02","-0,020 mm","PCB","PCB 128","ng/g",0.1,"-","-","-","-"]
["BELLARIA 02","-0,020 mm","PCB","PCB167","ng/g","<LOQ","-","-","-","-"]
["BELLARIA 02","-0,020 mm","PCB","PCB 156","ng/g","<LOQ","-","-","-","-"]
["BELLARIA 02","-0,020 mm","PCB","PCB 157","ng/g","<LOQ","-","-","-","-"]
["BELLARIA 02","-0,020 mm","PCB","PCB 180","ng/g",0.5,"-","-","-","-"]
["BELLARIA 02","-0,020 mm","PCB","PCB 170","ng/g",0.2,"-","-","-","-"]
["BELLARIA 02","-0,020 mm","PCB","PCB 169","ng/g","<LOQ","-","-","-","-"]
["BELLARIA 02","-0,020 mm","PCB","PCB 189","ng/g","<LOQ","-","-","-","-"]
["BELLARIA 02","-0,020 mm","PCB","PCB 209","ng/g",0.1,"-","-","-","-"]
["BELLARIA 02","-0,020 mm","PCB","Sum PCB","ng/g",3.7,60,5000,{"$f":"IF(F698<G698,\"Yes\",\"No\")","v":"Yes"},{"$f":"IF(F698<H698,\"Yes\",\"No\")","v":"Yes"}]
["BELLARIA 02","-0,020 mm","PCB","CB 110","ng/g",0.4,"-","-","-","-"]
["BELLARIA 02","Dredged sediment","Hydrocarbons (C > 12 mg/kg)",null,"mg/kg",28.52,50,750,{"$f":"IF(F700<G700,\"Yes\",\"No\")","v":"Yes"},{"$f":"IF(F700<H700,\"Yes\",\"No\")","v":"Yes"}]
["BELLARIA 02","-0,053 +0,020 mm","Hydrocarbons (C > 12 mg/kg)",null,"mg/kg",41.38,50,750,{"$f":"IF(F701<G701,\"Yes\",\"No\")","v":"Yes"},{"$f":"IF(F701<H701,\"Yes\",\"No\")","v":"Yes"}]
["BELLARIA 02","-0,020 mm","Hydrocarbons (C > 12 mg/kg)",null,"mg/kg",26.52,50,750,{"$f":"IF(F702<G702,\"Yes\",\"No\")","v":"Yes"},{"$f":"IF(F702<H702,\"Yes\",\"No\")","v":"Yes"}]
["BELLARIA 02","Dredged sediment","Tributyltin ",null,"μg/kg",4.9000000000000004,null,null,null,null,"*D. Lgs. 152/06: environmental quality standards in sediments expressed as the annual average   (SQA-MA) = 5 µg/kg SS * "]
["BELLARIA 02","-0,053 +0,020 mm","Tributyltin ",null,"μg/kg","11,90 *"]
["BELLARIA 02","-0,020 mm","Tributyltin ",null,"μg/kg",3.3]
["POGAR","+0,5 mm","Granulometric Analysis",null,"%",3.31]
["POGAR","-0,5 +0,063 mm","Granulometric Analysis",null,"%",92.06]
["POGAR","-0,063 mm","Granulometric Analysis",null,"%",4.63]
["POGAR","Dredged sediment","Shepard classification",null,null,"Sand"]
["POGAR","Dredged sediment","Nota classification",null,null,"Sand"]
["POGAR","Dredged sediment","VS (%TS)",null,"%",3.44]
["POGAR","-0,5 +0,063 mm","VS (%TS)",null,"%",1.48]
["POGAR","Dredged sediment","TC (%TS)",null,"%",2.89]
["POGAR","-0,5 +0,063 mm","TC (%TS)",null,"%",2.4500000000000002]
["POGAR","Dredged sediment","IC (%TS)",null,"%",1.36]
["POGAR","-0,5 +0,063 mm","IC (%TS)",null,"%",2.0299999999999998]
["POGAR","Dredged sediment","TOC (%TS)",null,"%",1.53]
["POGAR","-0,5 +0,063 mm","TOC (%TS)",null,"%",0.42]
["POGAR","Dredged sediment","O2 consumption (833.5h)",null,"(mg O2/kg TS)",1429.14]
["POGAR","-0,5 +0,063 mm","O2 consumption (833.5h)",null,"(mg O2/kg TS)",1156.54]
["POGAR","Dredged sediment","METALS","Zn ","mg/kg",127.66522386990937,150,1500,{"$f":"IF(F721<G721,\"Yes\",\"No\")","v":"Yes"},{"$f":"IF(F721<H721,\"Yes\",\"No\")","v":"Yes"}]
["POGAR","Dredged sediment","METALS","Ni","mg/kg",74.625631438299308,120,500,{"$f":"IF(F722<G722,\"Yes\",\"No\")","v":"Yes"},{"$f":"IF(F722<H722,\"Yes\",\"No\")","v":"Yes"}]
["POGAR","Dredged sediment","METALS","Cr","mg/kg",90.62,150,800,"Yes","Yes"]
["POGAR","Dredged sediment","METALS","Pb","mg/kg",25.933140658868847,100,1000,"Yes","Yes"]
["POGAR","Dredged sediment","METALS","As","μg/kg",7315.8724841135263,20000,50000,"Yes","Yes"]
["POGAR","Dredged sediment","METALS","Cd","μg/kg",719.37393274245471,2000,15000,"Yes","Yes"]
["POGAR","Dredged sediment","METALS","Hg","mg/kg",3.1300000000000001E-2,1,5,{"$f":"IF(F727<G727,\"Yes\",\"No\")","v":"Yes"},{"$f":"IF(F727<H727,\"Yes\",\"No\")","v":"Yes"}]
["POGAR","-0,5 +0,063 mm","METALS","Zn ","mg/kg",77.266243949362149,150,1500,"Yes","Yes"]
["POGAR","-0,5 +0,063 mm","METALS","Ni","mg/kg",50.622721894125327,120,500,"Yes","Yes"]
["POGAR","-0,5 +0,063 mm","METALS","Cr","mg/kg",66.609137393642769,150,800,"Yes","Yes"]
["POGAR","-0,5 +0,063 mm","METALS","Pb","mg/kg",28.321737500989062,100,1000,"Yes","Yes"]
["POGAR","-0,5 +0,063 mm","METALS","As","μg/kg",6767.6842105957139,20000,50000,"Yes","Yes"]
["POGAR","-0,5 +0,063 mm","METALS","Hg","mg/kg",1.8100000000000002E-2,1,5,{"$f":"IF(F733<G733,\"Yes\",\"No\")","v":"Yes"},{"$f":"IF(F733<H733,\"Yes\",\"No\")","v":"Yes"}]
["POGAR","-0,5 +0,063 mm","METALS","Cd","μg/kg",133.20816349444542,2000,15000,"Yes","Yes"]
["POGAR","-0,063 mm","METALS","Zn ","mg/kg",171.43055728278151,150,1500,{"$f":"IF(F735<G735,\"Yes\",\"No\")","v":"No"},"Yes"]
["POGAR","-0,063 mm","METALS","Ni","mg/kg",98.576909351493399,120,500,"Yes","Yes"]
["POGAR","-0,063 mm","METALS","Cr","mg/kg",133.21108337740091,150,800,"Yes","Yes"]
["POGAR","-0,063 mm","METALS","Pb","mg/kg",33.221095971306916,100,1000,"Yes","Yes"]
["POGAR","-0,063 mm","METALS","As","μg/kg",14373.269824867335,20000,50000,"Yes","Yes"]
["POGAR","-0,063 mm","METALS","Cd","μg/kg",253.09362735239367,2000,15000,"Yes","Yes"]
["POGAR","Dredged sediment","PAH","naphthalene ","ng/g",4.7631257276711167,"-","-","-","-"]
["POGAR","Dredged sediment","PAH","acenaphthene","ng/g","<LOQ","-","-","-","-"]
["POGAR","Dredged sediment","PAH","fluorene","ng/g",2.5337826963215488,"-","-","-","-"]
["POGAR","Dredged sediment","PAH","phenanthrene","ng/g",19.580316336331514,"-","-","-","-"]
["POGAR","Dredged sediment","PAH","anthracene","ng/g",2.7619768551155448,"-","-","-","-"]
["POGAR","Dredged sediment","PAH","fluoranthene","ng/g",29.017630061548548,"-","-","-","-"]
["POGAR","Dredged sediment","PAH","pyrene","ng/g",29.550473575537474,5000,50000,{"$f":"IF(F747<G747,\"Yes\",\"No\")","v":"Yes"},{"$f":"IF(F747<H747,\"Yes\",\"No\")","v":"Yes"}]
["POGAR","Dredged sediment","PAH","benzo(a)anthracene","ng/g",16.282527376257661,500,10000,{"$f":"IF(F748<G748,\"Yes\",\"No\")","v":"Yes"},{"$f":"IF(F748<H748,\"Yes\",\"No\")","v":"Yes"}]
["POGAR","Dredged sediment","PAH","chrysene","ng/g",20.644500101251236,5000,50000,"Yes","Yes"]
["POGAR","Dredged sediment","PAH","benzo(b)fluoranthene","ng/g",11.643649981911315,500,10000,"Yes","Yes"]
["POGAR","Dredged sediment","PAH","benzo(k)fluoranthene","ng/g",5.4003354610232996,500,10000,"Yes","Yes"]
["POGAR","Dredged sediment","PAH","benzo(a)pyrene","ng/g",10.536369946919212,100,10000,"Yes","Yes"]
["POGAR","Dredged sediment","PAH","dibenzo(a,h)anthracene","ng/g",0.69607038143926925,100,10000,"Yes","Yes"]
["POGAR","Dredged sediment","PAH","benzo(g,h,i)perylene","ng/g",5.5574776593117567,100,10000,"Yes","Yes"]
["POGAR","Dredged sediment","PAH","indeno(1,2,3,c,d)pyrene","ng/g",5.8064583471751217,100,5000,"Yes","Yes"]
["POGAR","Dredged sediment","PAH","Sum PAH","ng/g",164.77469450781462,10000,100000,"Yes","Yes"]
["POGAR","+0,5 mm","PAH","naphthalene ","ng/g",69.348972019937833,"-","-","-","-"]
["POGAR","+0,5 mm","PAH","acenaphthene","ng/g",39.782167400333933,"-","-","-","-"]
["POGAR","+0,5 mm","PAH","fluorene","ng/g",295.97948621088489,"-","-","-","-"]
["POGAR","+0,5 mm","PAH","phenanthrene","ng/g",1856.1625138466893,"-","-","-","-"]
["POGAR","+0,5 mm","PAH","anthracene","ng/g",593.54212312349318,"-","-","-","-"]
["POGAR","+0,5 mm","PAH","fluoranthene","ng/g",2575.1962830480516,"-","-","-","-"]
["POGAR","+0,5 mm","PAH","pyrene","ng/g",2233.8653276103651,5000,50000,{"$f":"IF(F763<G763,\"Yes\",\"No\")","v":"Yes"},{"$f":"IF(F763<H763,\"Yes\",\"No\")","v":"Yes"}]
["POGAR","+0,5 mm","PAH","benzo(a)anthracene","ng/g",1572.1442499039613,500,10000,{"$f":"IF(F764<G764,\"Yes\",\"No\")","v":"No"},{"$f":"IF(F764<H764,\"Yes\",\"No\")","v":"Yes"}]
["POGAR","+0,5 mm","PAH","chrysene","ng/g",1449.1745011112289,5000,50000,"Yes","Yes"]
["POGAR","+0,5 mm","PAH","benzo(b)fluoranthene","ng/g",858.01956885909294,500,10000,"No","Yes"]
["POGAR","+0,5 mm","PAH","benzo(k)fluoranthene","ng/g",525.5349912511399,500,10000,"No","Yes"]
["POGAR","+0,5 mm","PAH","benzo(a)pyrene","ng/g",1089.3208344979018,100,10000,"No","Yes"]
["POGAR","+0,5 mm","PAH","dibenzo(a,h)anthracene","ng/g",135.54002862424409,100,10000,"No","Yes"]
["POGAR","+0,5 mm","PAH","benzo(g,h,i)perylene","ng/g",382.00700072345137,100,10000,"No","Yes"]
["POGAR","+0,5 mm","PAH","indeno(1,2,3,c,d)pyrene","ng/g",592.96993285627582,100,5000,"No","Yes"]
["POGAR","+0,5 mm","PAH","Sum PAH","ng/g",14268.587981087054,10000,100000,"No","Yes"]
["POGAR","-0,5 +0,063 mm","PAH","naphthalene ","ng/g",3.3258757521942881,"-","-","-","-"]
["POGAR","-0,5 +0,063 mm","PAH","acenaphthene","ng/g","<LOQ","-","-","-","-"]
["POGAR","-0,5 +0,063 mm","PAH","fluorene","ng/g",0.86528112464013207,"-","-","-","-"]
["POGAR","-0,5 +0,063 mm","PAH","phenanthrene","ng/g",12.052913464335493,"-","-","-","-"]
["POGAR","-0,5 +0,063 mm","PAH","anthracene","ng/g","<LOQ","-","-","-","-"]
["POGAR","-0,5 +0,063 mm","PAH","fluoranthene","ng/g",7.296509564789206,"-","-","-","-"]
["POGAR","-0,5 +0,063 mm","PAH","pyrene","ng/g",10.312476597415358,5000,50000,{"$f":"IF(F779<G779,\"Yes\",\"No\")","v":"Yes"},{"$f":"IF(F779<H779,\"Yes\",\"No\")","v":"Yes"}]
["POGAR","-0,5 +0,063 mm","PAH","benzo(a)anthracene","ng/g",2.9478398122254843,500,10000,{"$f":"IF(F780<G780,\"Yes\",\"No\")","v":"Yes"},{"$f":"IF(F780<H780,\"Yes\",\"No\")","v":"Yes"}]
["POGAR","-0,5 +0,063 mm","PAH","chrysene","ng/g",6.7099781339280842,5000,50000,"Yes","Yes"]
["POGAR","-0,5 +0,063 mm","PAH","benzo(b)fluoranthene","ng/g",4.4699035413905346,500,10000,"Yes","Yes"]
["POGAR","-0,5 +0,063 mm","PAH","benzo(k)fluoranthene","ng/g",1.4351041474966519,500,10000,"Yes","Yes"]
["POGAR","-0,5 +0,063 mm","PAH","benzo(a)pyrene","ng/g",3.2447775246718784,100,10000,"Yes","Yes"]
["POGAR","-0,5 +0,063 mm","PAH","dibenzo(a,h)anthracene","ng/g","<LOQ",100,10000]
["POGAR","-0,5 +0,063 mm","PAH","benzo(g,h,i)perylene","ng/g",2.9551135419724375,100,10000,"Yes","Yes"]
["POGAR","-0,5 +0,063 mm","PAH","indeno(1,2,3,c,d)pyrene","ng/g",0.80616538433334473,100,5000,"Yes","Yes"]
["POGAR","-0,5 +0,063 mm","PAH","Sum PAH","ng/g",56.421938589392887,10000,100000,"Yes","Yes"]
["POGAR","-0,063 mm","PAH","naphthalene ","ng/g",10.872467093757141,"-","-","-","-"]
["POGAR","-0,063 mm","PAH","acenaphthene","ng/g",0.72984195936947183,"-","-","-","-"]
["POGAR","-0,063 mm","PAH","fluorene","ng/g",4.1005510657622963,"-","-","-","-"]
["POGAR","-0,063 mm","PAH","phenanthrene","ng/g",36.957001249895583,"-","-","-","-"]
["POGAR","-0,063 mm","PAH","anthracene","ng/g",3.8783659777401898,"-","-","-","-"]
["POGAR","-0,063 mm","PAH","fluoranthene","ng/g",32.195102050084401,"-","-","-","-"]
["POGAR","-0,063 mm","PAH","pyrene","ng/g",40.727435189192263,5000,50000,{"$f":"IF(F795<G795,\"Yes\",\"No\")","v":"Yes"},{"$f":"IF(F795<H795,\"Yes\",\"No\")","v":"Yes"}]
["POGAR","-0,063 mm","PAH","benzo(a)anthracene","ng/g",13.095017555384256,500,10000,{"$f":"IF(F796<G796,\"Yes\",\"No\")","v":"Yes"},{"$f":"IF(F796<H796,\"Yes\",\"No\")","v":"Yes"}]
["POGAR","-0,063 mm","PAH","chrysene","ng/g",20.304614996701154,5000,50000,"Yes","Yes"]
["POGAR","-0,063 mm","PAH","benzo(b)fluoranthene","ng/g",21.468398175964769,500,10000,"Yes","Yes"]
["POGAR","-0,063 mm","PAH","benzo(k)fluoranthene","ng/g",7.2077304571907739,500,10000,"Yes","Yes"]
["POGAR","-0,063 mm","PAH","benzo(a)pyrene","ng/g",13.282953061406772,100,10000,"Yes","Yes"]
["POGAR","-0,063 mm","PAH","dibenzo(a,h)anthracene","ng/g",1.1741959884495943,100,10000,"Yes","Yes"]
["POGAR","-0,063 mm","PAH","benzo(g,h,i)perylene","ng/g",12.415116937626323,100,10000,"Yes","Yes"]
["POGAR","-0,063 mm","PAH","indeno(1,2,3,c,d)pyrene","ng/g",10.129888847455554,100,5000,"Yes","Yes"]
["POGAR","-0,063 mm","PAH","Sum PAH","ng/g",228.53868060598055,10000,100000,"Yes","Yes"]
["POGAR","Dredged sediment","PCB","PCB 28","ng/g",0.40893608244872842,"-","-","-","-"]
["POGAR","Dredged sediment","PCB","PCB 52","ng/g",0.43667850958533294,"-","-","-","-"]
["POGAR","Dredged sediment","PCB","PCB 101","ng/g",0.8257342840382691,"-","-","-","-"]
["POGAR","Dredged sediment","PCB","PCB 81","ng/g","<LOQ","-","-","-","-"]
["POGAR","Dredged sediment","PCB","PCB 77","ng/g",0.27398293975558896,"-","-","-","-"]
["POGAR","Dredged sediment","PCB","PCB123","ng/g","<LOQ","-","-","-","-"]
["POGAR","Dredged sediment","PCB","PCB 118","ng/g",0.59550919929871782,"-","-","-","-"]
["POGAR","Dredged sediment","PCB","PCB 114","ng/g","<LOQ","-","-","-","-"]
["POGAR","Dredged sediment","PCB","PCB 153","ng/g",1.3140327677804526,"-","-","-","-"]
["POGAR","Dredged sediment","PCB","PCB 105","ng/g",0.18260234960715488,"-","-","-","-"]
["POGAR","Dredged sediment","PCB","PCB 138","ng/g",0.84550870490758578,"-","-","-","-"]
["POGAR","Dredged sediment","PCB","PCB 126","ng/g","<LOQ","-","-","-","-"]
["POGAR","Dredged sediment","PCB","PCB 128","ng/g",0.13100884723192366,"-","-","-","-"]
["POGAR","Dredged sediment","PCB","PCB167","ng/g","<LOQ","-","-","-","-"]
["POGAR","Dredged sediment","PCB","PCB 156","ng/g","<LOQ","-","-","-","-"]
["POGAR","Dredged sediment","PCB","PCB 157","ng/g","<LOQ","-","-","-","-"]
["POGAR","Dredged sediment","PCB","PCB 180","ng/g",0.36110157306338064,"-","-","-","-"]
["POGAR","Dredged sediment","PCB","PCB 170","ng/g",0.138923909935974,"-","-","-","-"]
["POGAR","Dredged sediment","PCB","PCB 169","ng/g","<LOQ","-","-","-","-"]
["POGAR","Dredged sediment","PCB","PCB 189","ng/g","<LOQ","-","-","-","-"]
["POGAR","Dredged sediment","PCB","PCB 209","ng/g","<LOQ","-","-","-","-"]
["POGAR","Dredged sediment","PCB","Sum PCB","ng/g",5.5140191676531076,60,5000,{"$f":"IF(F826<G826,\"Yes\",\"No\")","v":"Yes"},{"$f":"IF(F826<H826,\"Yes\",\"No\")","v":"Yes"}]
["POGAR","Dredged sediment","PCB","CB 110","ng/g",0.6,"-","-","-","-"]
["POGAR","+0,5 mm","PCB","PCB 28","ng/g",0.81194161410694521,"-","-","-","-"]
["POGAR","+0,5 mm","PCB","PCB 52","ng/g",2.3403022994847249,"-","-","-","-"]
["POGAR","+0,5 mm","PCB","PCB 101","ng/g",3.9068720019969478,"-","-","-","-"]
["POGAR","+0,5 mm","PCB","PCB 81","ng/g","<LOQ","-","-","-","-"]
["POGAR","+0,5 mm","PCB","PCB 77","ng/g",0.83104612267416744,"-","-","-","-"]
["POGAR","+0,5 mm","PCB","PCB123","ng/g",0.25791086565750027,"-","-","-","-"]
["POGAR","+0,5 mm","PCB","PCB 118","ng/g",2.6555266908438915,"-","-","-","-"]
["POGAR","+0,5 mm","PCB","PCB 114","ng/g","<LOQ","-","-","-","-"]
["POGAR","+0,5 mm","PCB","PCB 153","ng/g",7.9761323268152848,"-","-","-","-"]
["POGAR","+0,5 mm","PCB","PCB 105","ng/g",0.72597132555444521,"-","-","-","-"]
["POGAR","+0,5 mm","PCB","PCB 138","ng/g",4.6615000904022272,"-","-","-","-"]
["POGAR","+0,5 mm","PCB","PCB 126","ng/g","<LOQ","-","-","-","-"]
["POGAR","+0,5 mm","PCB","PCB 128","ng/g",0.91701641122666755,"-","-","-","-"]
["POGAR","+0,5 mm","PCB","PCB167","ng/g",0.26746311994111133,"-","-","-","-"]
["POGAR","+0,5 mm","PCB","PCB 156","ng/g",0.30567213707555585,"-","-","-","-"]
["POGAR","+0,5 mm","PCB","PCB 157","ng/g",0.12417930568694456,"-","-","-","-"]
["POGAR","+0,5 mm","PCB","PCB 180","ng/g",2.3211977909175023,"-","-","-","-"]
["POGAR","+0,5 mm","PCB","PCB 170","ng/g",0.79283710553972286,"-","-","-","-"]
["POGAR","+0,5 mm","PCB","PCB 169","ng/g","<LOQ","-","-","-","-"]
["POGAR","+0,5 mm","PCB","PCB 189","ng/g","<LOQ","-","-","-","-"]
["POGAR","+0,5 mm","PCB","PCB 209","ng/g","<LOQ","-","-","-","-"]
["POGAR","+0,5 mm","PCB","Sum PCB","ng/g",28.895569207923646,60,5000,{"$f":"IF(F849<G849,\"Yes\",\"No\")","v":"Yes"},{"$f":"IF(F849<H849,\"Yes\",\"No\")","v":"Yes"}]
["POGAR","+0,5 mm","PCB","CB 110","ng/g",3.8,"-","-","-","-"]
["POGAR","-0,5 +0,063 mm","PCB","PCB 28","ng/g",0.41138123605966515,"-","-","-","-"]
["POGAR","-0,5 +0,063 mm","PCB","PCB 52","ng/g",0.40469444016411732,"-","-","-","-"]
["POGAR","-0,5 +0,063 mm","PCB","PCB 101","ng/g",0.68761755078752695,"-","-","-","-"]
["POGAR","-0,5 +0,063 mm","PCB","PCB 81","ng/g","<LOQ","-","-","-","-"]
["POGAR","-0,5 +0,063 mm","PCB","PCB 77","ng/g",0.20418608895333434,"-","-","-","-"]
["POGAR","-0,5 +0,063 mm","PCB","PCB123","ng/g","<LOQ","-","-","-","-"]
["POGAR","-0,5 +0,063 mm","PCB","PCB 118","ng/g",0.44051656103312342,"-","-","-","-"]
["POGAR","-0,5 +0,063 mm","PCB","PCB 114","ng/g","<LOQ","-","-","-","-"]
["POGAR","-0,5 +0,063 mm","PCB","PCB 153","ng/g",1.0600720821695391,"-","-","-","-"]
["POGAR","-0,5 +0,063 mm","PCB","PCB 105","ng/g",0.14324072064819876,"-","-","-","-"]
["POGAR","-0,5 +0,063 mm","PCB","PCB 138","ng/g",0.67675150745726165,"-","-","-","-"]
["POGAR","-0,5 +0,063 mm","PCB","PCB 126","ng/g","<LOQ","-","-","-","-"]
["POGAR","-0,5 +0,063 mm","PCB","PCB 128","ng/g",0.1146069053669066,"-","-","-","-"]
["POGAR","-0,5 +0,063 mm","PCB","PCB167","ng/g","<LOQ","-","-","-","-"]
["POGAR","-0,5 +0,063 mm","PCB","PCB 156","ng/g","<LOQ","-","-","-","-"]
["POGAR","-0,5 +0,063 mm","PCB","PCB 157","ng/g","<LOQ","-","-","-","-"]
["POGAR","-0,5 +0,063 mm","PCB","PCB 180","ng/g",0.33656076627126791,"-","-","-","-"]
["POGAR","-0,5 +0,063 mm","PCB","PCB 170","ng/g",0.16468623034177701,"-","-","-","-"]
["POGAR","-0,5 +0,063 mm","PCB","PCB 169","ng/g","<LOQ","-","-","-","-"]
["POGAR","-0,5 +0,063 mm","PCB","PCB 189","ng/g","<LOQ","-","-","-","-"]
["POGAR","-0,5 +0,063 mm","PCB","PCB 209","ng/g","<LOQ","-","-","-","-"]
["POGAR","-0,5 +0,063 mm","PCB","Sum PCB","ng/g",4.6443140892527195,60,5000,{"$f":"IF(F872<G872,\"Yes\",\"No\")","v":"Yes"},{"$f":"IF(F872<H872,\"Yes\",\"No\")","v":"Yes"}]
["POGAR","-0,5 +0,063 mm","PCB","CB 110","ng/g",0.5,"-","-","-","-"]
["POGAR","-0,063 mm","PCB","PCB 28","ng/g",1.2545136358794013,"-","-","-","-"]
["POGAR","-0,063 mm","PCB","PCB 52","ng/g",1.3036652308610062,"-","-","-","-"]
["POGAR","-0,063 mm","PCB","PCB 101","ng/g",2.3086490106159676,"-","-","-","-"]
["POGAR","-0,063 mm","PCB","PCB 81","ng/g","<LOQ","-","-","-","-"]
["POGAR","-0,063 mm","PCB","PCB 77","ng/g",0.83988783607747308,"-","-","-","-"]
["POGAR","-0,063 mm","PCB","PCB123","ng/g",0.14052014618668573,"-","-","-","-"]
["POGAR","-0,063 mm","PCB","PCB 118","ng/g",1.7359087615619653,"-","-","-","-"]
["POGAR","-0,063 mm","PCB","PCB 114","ng/g","<LOQ","-","-","-","-"]
["POGAR","-0,063 mm","PCB","PCB 153","ng/g",3.8020796939798331,"-","-","-","-"]
["POGAR","-0,063 mm","PCB","PCB 105","ng/g",0.53762192642415219,"-","-","-","-"]
["POGAR","-0,063 mm","PCB","PCB 138","ng/g",2.5897127308229817,"-","-","-","-"]
["POGAR","-0,063 mm","PCB","PCB 126","ng/g","<LOQ","-","-","-","-"]
["POGAR","-0,063 mm","PCB","PCB 128","ng/g",0.43222010286731666,"-","-","-","-"]
["POGAR","-0,063 mm","PCB","PCB167","ng/g",0.15110952699301819,"-","-","-","-"]
["POGAR","-0,063 mm","PCB","PCB 156","ng/g",0.25288003633529277,"-","-","-","-"]
["POGAR","-0,063 mm","PCB","PCB 157","ng/g",0.14054357402032808,"-","-","-","-"]
["POGAR","-0,063 mm","PCB","PCB 180","ng/g",1.4019918486578584,"-","-","-","-"]
["POGAR","-0,063 mm","PCB","PCB 170","ng/g",0.52356522623875501,"-","-","-","-"]
["POGAR","-0,063 mm","PCB","PCB 169","ng/g","<LOQ","-","-","-","-"]
["POGAR","-0,063 mm","PCB","PCB 189","ng/g","<LOQ","-","-","-","-"]
["POGAR","-0,063 mm","PCB","PCB 209","ng/g","<LOQ","-","-","-","-"]
["POGAR","-0,063 mm","PCB","Sum PCB","ng/g",17.414869287522034,60,5000,{"$f":"IF(F895<G895,\"Yes\",\"No\")","v":"Yes"},{"$f":"IF(F895<H895,\"Yes\",\"No\")","v":"Yes"}]
["POGAR","-0,063 mm","PCB","CB 110","ng/g",1.8,"-","-","-","-"]
["POGAR","Dredged sediment","Hydrocarbons (C > 12 mg/kg)",null,"mg/kg",13,50,750,{"$f":"IF(F897<G897,\"Yes\",\"No\")","v":"Yes"},{"$f":"IF(F897<H897,\"Yes\",\"No\")","v":"Yes"}]
["POGAR","-1+0,5 mm","Hydrocarbons (C > 12 mg/kg)",null,"mg/kg",67,50,750,{"$f":"IF(F898<G898,\"Yes\",\"No\")","v":"No"},{"$f":"IF(F898<H898,\"Yes\",\"No\")","v":"Yes"}]
["POGAR","-0,5 +0,063 mm","Hydrocarbons (C > 12 mg/kg)",null,"mg/kg",12,50,750,{"$f":"IF(F899<G899,\"Yes\",\"No\")","v":"Yes"},{"$f":"IF(F899<H899,\"Yes\",\"No\")","v":"Yes"}]
["POGAR","-0,063 mm","Hydrocarbons (C > 12 mg/kg)",null,"mg/kg",34,50,750,{"$f":"IF(F900<G900,\"Yes\",\"No\")","v":"Yes"},{"$f":"IF(F900<H900,\"Yes\",\"No\")","v":"Yes"}]
["POGAR","Dredged sediment","Tributyltin ",null,"μg/kg","5,6 *",null,null,null,null,"*D. Lgs. 152/06: environmental quality standards in sediments expressed as the annual average   (SQA-MA) = 5 µg/kg SS * "]
["POGAR","-1+0,5 mm","Tributyltin ",null,"μg/kg","12,7 *"]
["POGAR","-0,5 +0,063 mm","Tributyltin ",null,"μg/kg","9,2 *"]
["POGAR","-0,063 mm","Tributyltin ",null,"μg/kg","9,2 *"]
["POGAR","Dredged sediment","Pesticedes","HCB","ng/g","<LOQ",50,5000]
["POGAR","Dredged sediment","Pesticedes","a-HCH","ng/g","<LOQ","-","-","-","-"]
["POGAR","Dredged sediment","Pesticedes","b-HCH","ng/g","<LOQ","-","-","-","-"]
["POGAR","Dredged sediment","Pesticedes","g-HCH","ng/g","<LOQ","-","-","-","-"]
["POGAR","Dredged sediment","Pesticedes","Aldrin","ng/g","<LOQ",10,100]
["POGAR","Dredged sediment","Pesticedes","o,p` DDE","ng/g",0.11104912389127497,10,100,{"$f":"IF(F910<G910,\"Yes\",\"No\")","v":"Yes"},{"$f":"IF(F910<H910,\"Yes\",\"No\")","v":"Yes"}]
["POGAR","Dredged sediment","Pesticedes","g-chlordane","ng/g",0.38908224623455528,null,null,"-","-"]
["POGAR","Dredged sediment","Pesticedes","a-chlordane","ng/g","<LOQ",null,null,"-","-"]
["POGAR","Dredged sediment","Pesticedes","p,p`DDE","ng/g",0.67886883961662592,10,100,{"$f":"IF(F913<G913,\"Yes\",\"No\")","v":"Yes"},{"$f":"IF(F913<H913,\"Yes\",\"No\")","v":"Yes"}]
["POGAR","Dredged sediment","Pesticedes","Dieldrin","ng/g","<LOQ",10,100]
["POGAR","Dredged sediment","Pesticedes","o,p`DDD","ng/g",0.25407615997817806,10,100,"Yes","Yes"]
["POGAR","Dredged sediment","Pesticedes","Endrin","ng/g","<LOQ",10,2000]
["POGAR","Dredged sediment","Pesticedes","o,p`DDT","ng/g",0.12293495383815992,10,100,"Yes","Yes"]
["POGAR","Dredged sediment","Pesticedes","p,p`DDD","ng/g",0.5836233693518329,10,100,"Yes","Yes"]
["POGAR","Dredged sediment","Pesticedes","p,p`DDT","ng/g",0.32523230896977451,10,100,"Yes","Yes"]
["POGAR","+0,5 mm","Pesticedes","HCB","ng/g",0.1814928313886113,50,5000,{"$f":"IF(F920<G920,\"Yes\",\"No\")","v":"Yes"},{"$f":"IF(F920<H920,\"Yes\",\"No\")","v":"Yes"}]
["POGAR","+0,5 mm","Pesticedes","a-HCH","ng/g","<LOQ","-","-","-","-"]
["POGAR","+0,5 mm","Pesticedes","b-HCH","ng/g","<LOQ","-","-","-","-"]
["POGAR","+0,5 mm","Pesticedes","g-HCH","ng/g","<LOQ","-","-","-","-"]
["POGAR","+0,5 mm","Pesticedes","Aldrin","ng/g","<LOQ",10,100]
["POGAR","+0,5 mm","Pesticedes","o,p` DDE","ng/g",0.34388115421000037,10,100,{"$f":"IF(F925<G925,\"Yes\",\"No\")","v":"Yes"},{"$f":"IF(F925<H925,\"Yes\",\"No\")","v":"Yes"}]
["POGAR","+0,5 mm","Pesticedes","g-chlordane","ng/g",1.4041813796908347,null,null,"-","-"]
["POGAR","+0,5 mm","Pesticedes","a-chlordane","ng/g",0.1814928313886113,null,null,"-","-"]
["POGAR","+0,5 mm","Pesticedes","p,p`DDE","ng/g",4.0788125791019478,10,100,{"$f":"IF(F928<G928,\"Yes\",\"No\")","v":"Yes"},{"$f":"IF(F928<H928,\"Yes\",\"No\")","v":"Yes"}]
["POGAR","+0,5 mm","Pesticedes","Dieldrin","ng/g","<LOQ",10,100]
["POGAR","+0,5 mm","Pesticedes","o,p`DDD","ng/g",1.3659723625563902,10,100,"Yes","Yes"]
["POGAR","+0,5 mm","Pesticedes","Endrin","ng/g","<LOQ",10,2000]
["POGAR","+0,5 mm","Pesticedes","o,p`DDT","ng/g",0.62089652843472287,10,100,"Yes","Yes"]
["POGAR","+0,5 mm","Pesticedes","p,p`DDD","ng/g",2.6077654194258355,10,100,"Yes","Yes"]
["POGAR","+0,5 mm","Pesticedes","p,p`DDT","ng/g",1.10806149689889,10,100,"Yes","Yes"]
["POGAR","-0,5 +0,063 mm","Pesticedes","HCB","ng/g",0.12886410947277102,50,5000,{"$f":"IF(F935<G935,\"Yes\",\"No\")","v":"Yes"},{"$f":"IF(F935<H935,\"Yes\",\"No\")","v":"Yes"}]
["POGAR","-0,5 +0,063 mm","Pesticedes","a-HCH","ng/g","<LOQ","-","-","-","-"]
["POGAR","-0,5 +0,063 mm","Pesticedes","b-HCH","ng/g","<LOQ","-","-","-","-"]
["POGAR","-0,5 +0,063 mm","Pesticedes","g-HCH","ng/g","<LOQ","-","-","-","-"]
["POGAR","-0,5 +0,063 mm","Pesticedes","Aldrin","ng/g","<LOQ",10,100]
["POGAR","-0,5 +0,063 mm","Pesticedes","o,p` DDE","ng/g","<LOQ",10,100]
["POGAR","-0,5 +0,063 mm","Pesticedes","g-chlordane","ng/g",0.30802247664562649,null,null,"-","-"]
["POGAR","-0,5 +0,063 mm","Pesticedes","a-chlordane","ng/g","<LOQ",null,null,"-","-"]
["POGAR","-0,5 +0,063 mm","Pesticedes","p,p`DDE","ng/g",0.5085547092703222,10,100,{"$f":"IF(F943<G943,\"Yes\",\"No\")","v":"Yes"},{"$f":"IF(F943<H943,\"Yes\",\"No\")","v":"Yes"}]
["POGAR","-0,5 +0,063 mm","Pesticedes","Dieldrin","ng/g","<LOQ",10,100]
["POGAR","-0,5 +0,063 mm","Pesticedes","o,p`DDD","ng/g",0.20055611403860835,10,100,"Yes","Yes"]
["POGAR","-0,5 +0,063 mm","Pesticedes","Endrin","ng/g","<LOQ",10,2000]
["POGAR","-0,5 +0,063 mm","Pesticedes","o,p`DDT","ng/g","<LOQ",10,100]
["POGAR","-0,5 +0,063 mm","Pesticedes","p,p`DDD","ng/g",0.37964283696972589,10,100,"Yes","Yes"]
["POGAR","-0,5 +0,063 mm","Pesticedes","p,p`DDT","ng/g",0.13578971950744551,10,100,"Yes","Yes"]
["POGAR","-0,063 mm","Pesticedes","HCB","ng/g",0.42512146927369115,50,5000,{"$f":"IF(F950<G950,\"Yes\",\"No\")","v":"Yes"},{"$f":"IF(F950<H950,\"Yes\",\"No\")","v":"Yes"}]
["POGAR","-0,063 mm","Pesticedes","a-HCH","ng/g","<LOQ","-","-","-","-"]
["POGAR","-0,063 mm","Pesticedes","b-HCH","ng/g","<LOQ","-","-","-","-"]
["POGAR","-0,063 mm","Pesticedes","g-HCH","ng/g","<LOQ","-","-","-","-"]
["POGAR","-0,063 mm","Pesticedes","Aldrin","ng/g","<LOQ",10,100]
["POGAR","-0,063 mm","Pesticedes","o,p` DDE","ng/g",0.25993181426163364,10,100,{"$f":"IF(F955<G955,\"Yes\",\"No\")","v":"Yes"},{"$f":"IF(F955<H955,\"Yes\",\"No\")","v":"Yes"}]
["POGAR","-0,063 mm","Pesticedes","g-chlordane","ng/g",1.0647481833765411,null,null,"-","-"]
["POGAR","-0,063 mm","Pesticedes","a-chlordane","ng/g","<LOQ",null,null,"-","-"]
["POGAR","-0,063 mm","Pesticedes","p,p`DDE","ng/g",2.0135051623899143,10,100,{"$f":"IF(F958<G958,\"Yes\",\"No\")","v":"Yes"},{"$f":"IF(F958<H958,\"Yes\",\"No\")","v":"Yes"}]
["POGAR","-0,063 mm","Pesticedes","Dieldrin","ng/g","<LOQ",10,100]
["POGAR","-0,063 mm","Pesticedes","o,p`DDD","ng/g",0.68521727837082103,10,100,"Yes","Yes"]
["POGAR","-0,063 mm","Pesticedes","Endrin","ng/g","<LOQ",10,2000]
["POGAR","-0,063 mm","Pesticedes","o,p`DDT","ng/g",0.2493658612889435,10,100,"Yes","Yes"]
["POGAR","-0,063 mm","Pesticedes","p,p`DDD","ng/g",1.482911586058461,10,100,"Yes","Yes"]
["POGAR","-0,063 mm","Pesticedes","p,p`DDT","ng/g",0.62168099353282646,10,100,"Yes","Yes"]
["POCES 03","+0,5 mm","Granulometric Analysis",null,"%",5.34]
["POCES 03","-0,5 +0,063 mm","Granulometric Analysis",null,"%",84.8]
["POCES 03","-0,063 mm","Granulometric Analysis",null,"%",9.86]
["POCES 03","Dredged sediment","Shepard classification",null,null,"Sand"]
["POCES 03","Dredged sediment","Nota classification",null,null,"Sand"]
["POCES 03","Dredged sediment","VS (%TS)",null,"%",6.31]
["POCES 03","-0,5 +0,063 mm","VS (%TS)",null,"%",4.2300000000000004]
["POCES 03","Dredged sediment","TC (%TS)",null,"%",4.9000000000000004]
["POCES 03","-0,5 +0,063 mm","TC (%TS)",null,"%",4.99]
["POCES 03","Dredged sediment","IC (%TS)",null,"%",2.9]
["POCES 03","-0,5 +0,063 mm","IC (%TS)",null,"%",3.83]
["POCES 03","Dredged sediment","TOC (%TS)",null,"%",2]
["POCES 03","-0,5 +0,063 mm","TOC (%TS)",null,"%",1.84]
["POCES 03","Dredged sediment","O2 consumption (840 h)",null,"(mg O2/kg TS)",36768.97]
["POCES 03","-0,5 +0,063 mm","O2 consumption (840 h)",null,"(mg O2/kg TS)",2321.0700000000002]
["POCES 03","Dredged sediment","METALS","Zn ","mg/kg",84.465000000000003,150,1500,{"$f":"IF(F980<G980,\"Yes\",\"No\")","v":"Yes"},{"$f":"IF(F980<H980,\"Yes\",\"No\")","v":"Yes"}]
["POCES 03","Dredged sediment","METALS","Ni","mg/kg",10.385,120,500,{"$f":"IF(F981<G981,\"Yes\",\"No\")","v":"Yes"},{"$f":"IF(F981<H981,\"Yes\",\"No\")","v":"Yes"}]
["POCES 03","Dredged sediment","METALS","Cr","mg/kg",41.93,150,800,"Yes","Yes"]
["POCES 03","Dredged sediment","METALS","Pb","mg/kg",50.26,100,1000,"Yes","Yes"]
["POCES 03","Dredged sediment","METALS","As","mg/kg",17.535,20,50,{"$f":"IF(F984<G984,\"Yes\",\"No\")","v":"Yes"},{"$f":"IF(F984<H984,\"Yes\",\"No\")","v":"Yes"}]
["POCES 03","Dredged sediment","METALS","Cd","mg/kg",0.46,2,15,"Yes","Yes"]
["POCES 03","Dredged sediment","METALS","Cu","mg/kg",23.965,120,600,"Yes","Yes"]
["POCES 03","Dredged sediment","METALS","V","mg/kg",35.42,90,250,"Yes","Yes"]
["POCES 03","Dredged sediment","METALS","Hg","mg/kg",5.2200000000000003E-2,1,5,{"$f":"IF(F988<G988,\"Yes\",\"No\")","v":"Yes"},{"$f":"IF(F988<H988,\"Yes\",\"No\")","v":"Yes"}]
["POCES 03","-2 +0,5 mm","METALS","Zn ","mg/kg",107.91,150,1500,{"$f":"IF(F989<G989,\"Yes\",\"No\")","v":"Yes"},{"$f":"IF(F989<H989,\"Yes\",\"No\")","v":"Yes"}]
["POCES 03","-2 +0,5 mm","METALS","Ni","mg/kg",35.519999999999996,120,500,"Yes","Yes"]
["POCES 03","-2 +0,5 mm","METALS","Cr","mg/kg",39.89,150,800,"Yes","Yes"]
["POCES 03","-2 +0,5 mm","METALS","Pb","mg/kg",34.869999999999997,100,1000,"Yes","Yes"]
["POCES 03","-2 +0,5 mm","METALS","As","mg/kg",71.105000000000004,20,50,"No","No"]
["POCES 03","-2 +0,5 mm","METALS","Cd","mg/kg",0.66,2,15,"Yes","Yes"]
["POCES 03","-2 +0,5 mm","METALS","Cu","mg/kg",65.824999999999989,120,600,"Yes","Yes"]
["POCES 03","-2 +0,5 mm","METALS","V","mg/kg",35.96,90,250,"Yes","Yes"]
["POCES 03","-2 +0,5 mm","METALS","Hg","mg/kg",6.5600000000000006E-2,1,5,{"$f":"IF(F997<G997,\"Yes\",\"No\")","v":"Yes"},{"$f":"IF(F997<H997,\"Yes\",\"No\")","v":"Yes"}]
["POCES 03","-0,5 +0,063 mm","METALS","Zn ","mg/kg",85.405000000000001,150,1500,"Yes","Yes"]
["POCES 03","-0,5 +0,063 mm","METALS","Ni","mg/kg",43.89,120,500,"Yes","Yes"]
["POCES 03","-0,5 +0,063 mm","METALS","Cr","mg/kg",43.9,150,800,"Yes","Yes"]
["POCES 03","-0,5 +0,063 mm","METALS","Pb","mg/kg",40.055,100,1000,"Yes","Yes"]
["POCES 03","-0,5 +0,063 mm","METALS","As","mg/kg",15.84,20,50,"Yes","Yes"]
["POCES 03","-0,5 +0,063 mm","METALS","Cd","mg/kg",0.42000000000000004,2,15,"Yes","Yes"]
["POCES 03","-0,5 +0,063 mm","METALS","Cu","mg/kg",23.945,120,600,{"$f":"IF(F1004<G1004,\"Yes\",\"No\")","v":"Yes"},{"$f":"IF(F1004<H1004,\"Yes\",\"No\")","v":"Yes"}]
["POCES 03","-0,5 +0,063 mm","METALS","V","mg/kg",47.33,90,250,"Yes","Yes"]
["POCES 03","-0,5 +0,063 mm","METALS","Hg","mg/kg",4.5100000000000001E-2,1,5,{"$f":"IF(F1006<G1006,\"Yes\",\"No\")","v":"Yes"},{"$f":"IF(F1006<H1006,\"Yes\",\"No\")","v":"Yes"}]
["POCES 03","-0,063 mm","METALS","Zn ","mg/kg",118.605,150,1500,{"$f":"IF(F1007<G1007,\"Yes\",\"No\")","v":"Yes"},"Yes"]
["POCES 03","-0,063 mm","METALS","Ni","mg/kg",53.914999999999999,120,500,{"$f":"IF(F1008<G1008,\"Yes\",\"No\")","v":"Yes"},"Yes"]
["POCES 03","-0,063 mm","METALS","Cr","mg/kg",65.89,150,800,"Yes","Yes"]
["POCES 03","-0,063 mm","METALS","Pb","mg/kg",39.450000000000003,100,1000,"Yes","Yes"]
["POCES 03","-0,063 mm","METALS","As","mg/kg",15.9,20,50,"Yes",{"$f":"IF(F1011<H1011,\"Yes\",\"No\")","v":"Yes"}]
["POCES 03","-0,063 mm","METALS","Cd","mg/kg",0.46,2,15,"Yes","Yes"]
["POCES 03","-0,063 mm","METALS","Cu","mg/kg",33.94,120,600,"Yes","Yes"]
["POCES 03","-0,063 mm","METALS","V","mg/kg",72.734999999999999,90,250,{"$f":"IF(F1014<G1014,\"Yes\",\"No\")","v":"Yes"},{"$f":"IF(F1014<H1014,\"Yes\",\"No\")","v":"Yes"}]
["POCES 03","-0,063 mm","METALS","Hg","mg/kg",5.33E-2,1,5,"Yes","Yes"]
["POCES 03","Dredged sediment","PAH","naphthalene ","ng/g",24.110071290378926,"-","-","-","-"]
["POCES 03","Dredged sediment","PAH","acenaphthene","ng/g",18.383104060661967,"-","-","-","-"]
["POCES 03","Dredged sediment","PAH","fluorene","ng/g",26.635804498250589,"-","-","-","-"]
["POCES 03","Dredged sediment","PAH","phenanthrene","ng/g",287.92374495105616,"-","-","-","-"]
["POCES 03","Dredged sediment","PAH","anthracene","ng/g",60.138712197949069,"-","-","-","-"]
["POCES 03","Dredged sediment","PAH","fluoranthene","ng/g",406.48275005380646,"-","-","-","-"]
["POCES 03","Dredged sediment","PAH","pyrene","ng/g",399.43513710597017,5000,50000,{"$f":"IF(F1022<G1022,\"Yes\",\"No\")","v":"Yes"},{"$f":"IF(F1022<H1022,\"Yes\",\"No\")","v":"Yes"}]
["POCES 03","Dredged sediment","PAH","benzo(a)anthracene","ng/g",162.72126242408947,500,10000,{"$f":"IF(F1023<G1023,\"Yes\",\"No\")","v":"Yes"},{"$f":"IF(F1023<H1023,\"Yes\",\"No\")","v":"Yes"}]
["POCES 03","Dredged sediment","PAH","chrysene","ng/g",203.24690294544718,5000,50000,"Yes","Yes"]
["POCES 03","Dredged sediment","PAH","benzo(b)fluoranthene","ng/g",163.03797386075192,500,10000,"Yes","Yes"]
["POCES 03","Dredged sediment","PAH","benzo(k)fluoranthene","ng/g",75.010471113441653,500,10000,"Yes","Yes"]
["POCES 03","Dredged sediment","PAH","benzo(a)pyrene","ng/g",171.92961608176563,100,10000,"No","Yes"]
["POCES 03","Dredged sediment","PAH","dibenzo(a,h)anthracene","ng/g",14.941152859159272,100,10000,"Yes","Yes"]
["POCES 03","Dredged sediment","PAH","benzo(g,h,i)perylene","ng/g",103.08056105235477,100,10000,"No","Yes"]
["POCES 03","Dredged sediment","PAH","indeno(1,2,3,c,d)pyrene","ng/g",86.628613013566849,100,5000,"Yes","Yes"]
["POCES 03","Dredged sediment","PAH","Sum PAH","ng/g",2203.7058775086498,10000,100000,"Yes","Yes"]
["POCES 03","+0,5 mm","PAH","naphthalene ","ng/g",124.36197140533224,"-","-","-","-"]
["POCES 03","+0,5 mm","PAH","acenaphthene","ng/g",240.98921736480293,"-","-","-","-"]
["POCES 03","+0,5 mm","PAH","fluorene","ng/g",285.25392285844077,"-","-","-","-"]
["POCES 03","+0,5 mm","PAH","phenanthrene","ng/g",3427.0175039541464,"-","-","-","-"]
["POCES 03","+0,5 mm","PAH","anthracene","ng/g",684.17629317552723,"-","-","-","-"]
["POCES 03","+0,5 mm","PAH","fluoranthene","ng/g",4406.5933465022717,"-","-","-","-"]
["POCES 03","+0,5 mm","PAH","pyrene","ng/g",3712.6991366991183,5000,50000,{"$f":"IF(F1038<G1038,\"Yes\",\"No\")","v":"Yes"},{"$f":"IF(F1038<H1038,\"Yes\",\"No\")","v":"Yes"}]
["POCES 03","+0,5 mm","PAH","benzo(a)anthracene","ng/g",1563.3187072470214,500,10000,{"$f":"IF(F1039<G1039,\"Yes\",\"No\")","v":"No"},{"$f":"IF(F1039<H1039,\"Yes\",\"No\")","v":"Yes"}]
["POCES 03","+0,5 mm","PAH","chrysene","ng/g",1815.229450239965,5000,50000,"Yes","Yes"]
["POCES 03","+0,5 mm","PAH","benzo(b)fluoranthene","ng/g",1431.1233120192078,500,10000,"No","Yes"]
["POCES 03","+0,5 mm","PAH","benzo(k)fluoranthene","ng/g",656.73015702788371,500,10000,"No","Yes"]
["POCES 03","+0,5 mm","PAH","benzo(a)pyrene","ng/g",1323.7410345992866,100,10000,"No","Yes"]
["POCES 03","+0,5 mm","PAH","dibenzo(a,h)anthracene","ng/g",119.0776676905852,100,10000,"No","Yes"]
["POCES 03","+0,5 mm","PAH","benzo(g,h,i)perylene","ng/g",902.84186872462647,100,10000,"No","Yes"]
["POCES 03","+0,5 mm","PAH","indeno(1,2,3,c,d)pyrene","ng/g",779.68144221802845,100,5000,"No","Yes"]
["POCES 03","+0,5 mm","PAH","Sum PAH","ng/g",21472.835031726245,10000,100000,"No","Yes"]
["POCES 03","-0,5 +0,063 mm","PAH","naphthalene ","ng/g",41.616990629021977,"-","-","-","-"]
["POCES 03","-0,5 +0,063 mm","PAH","acenaphthene","ng/g",14.020452123331197,"-","-","-","-"]
["POCES 03","-0,5 +0,063 mm","PAH","fluorene","ng/g",24.756270064741198,"-","-","-","-"]
["POCES 03","-0,5 +0,063 mm","PAH","phenanthrene","ng/g",295.9810175569674,"-","-","-","-"]
["POCES 03","-0,5 +0,063 mm","PAH","anthracene","ng/g",59.444588019069364,"-","-","-","-"]
["POCES 03","-0,5 +0,063 mm","PAH","fluoranthene","ng/g",486.08987722446562,"-","-","-","-"]
["POCES 03","-0,5 +0,063 mm","PAH","pyrene","ng/g",409.86914860363714,5000,50000,{"$f":"IF(F1054<G1054,\"Yes\",\"No\")","v":"Yes"},{"$f":"IF(F1054<H1054,\"Yes\",\"No\")","v":"Yes"}]
["POCES 03","-0,5 +0,063 mm","PAH","benzo(a)anthracene","ng/g",228.57850545075985,500,10000,{"$f":"IF(F1055<G1055,\"Yes\",\"No\")","v":"Yes"},{"$f":"IF(F1055<H1055,\"Yes\",\"No\")","v":"Yes"}]
["POCES 03","-0,5 +0,063 mm","PAH","chrysene","ng/g",292.65561776742021,5000,50000,"Yes","Yes"]
["POCES 03","-0,5 +0,063 mm","PAH","benzo(b)fluoranthene","ng/g",208.67356413374605,500,10000,"Yes","Yes"]
["POCES 03","-0,5 +0,063 mm","PAH","benzo(k)fluoranthene","ng/g",101.11771973281238,500,10000,"Yes","Yes"]
["POCES 03","-0,5 +0,063 mm","PAH","benzo(a)pyrene","ng/g",196.41519541832386,100,10000,"No","Yes"]
["POCES 03","-0,5 +0,063 mm","PAH","dibenzo(a,h)anthracene","ng/g",19.167758722211659,100,10000]
["POCES 03","-0,5 +0,063 mm","PAH","benzo(g,h,i)perylene","ng/g",132.69233177428859,100,10000,{"$f":"IF(F1061<G1061,\"Yes\",\"No\")","v":"No"},{"$f":"IF(F1061<H1061,\"Yes\",\"No\")","v":"Yes"}]
["POCES 03","-0,5 +0,063 mm","PAH","indeno(1,2,3,c,d)pyrene","ng/g",97.242177904881089,100,5000,"Yes","Yes"]
["POCES 03","-0,5 +0,063 mm","PAH","Sum PAH","ng/g",2608.3212151256776,10000,100000,"Yes","Yes"]
["POCES 03","-0,063 mm","PAH","naphthalene ","ng/g",2.9522660386441295,"-","-","-","-"]
["POCES 03","-0,063 mm","PAH","acenaphthene","ng/g",0.46199830403208014,"-","-","-","-"]
["POCES 03","-0,063 mm","PAH","fluorene","ng/g",4.1137645909153635,"-","-","-","-"]
["POCES 03","-0,063 mm","PAH","phenanthrene","ng/g",33.266646307093517,"-","-","-","-"]
["POCES 03","-0,063 mm","PAH","anthracene","ng/g",4.3245625674808181,"-","-","-","-"]
["POCES 03","-0,063 mm","PAH","fluoranthene","ng/g",42.81090871729068,"-","-","-","-"]
["POCES 03","-0,063 mm","PAH","pyrene","ng/g",40.324235383314488,5000,50000,{"$f":"IF(F1070<G1070,\"Yes\",\"No\")","v":"Yes"},{"$f":"IF(F1070<H1070,\"Yes\",\"No\")","v":"Yes"}]
["POCES 03","-0,063 mm","PAH","benzo(a)anthracene","ng/g",13.678268937709406,500,10000,{"$f":"IF(F1071<G1071,\"Yes\",\"No\")","v":"Yes"},{"$f":"IF(F1071<H1071,\"Yes\",\"No\")","v":"Yes"}]
["POCES 03","-0,063 mm","PAH","chrysene","ng/g",17.963533683281366,5000,50000,"Yes","Yes"]
["POCES 03","-0,063 mm","PAH","benzo(b)fluoranthene","ng/g",26.784459092246419,500,10000,"Yes","Yes"]
["POCES 03","-0,063 mm","PAH","benzo(k)fluoranthene","ng/g",7.8743921780150394,500,10000,"Yes","Yes"]
["POCES 03","-0,063 mm","PAH","benzo(a)pyrene","ng/g",14.01873687132715,100,10000,"Yes","Yes"]
["POCES 03","-0,063 mm","PAH","dibenzo(a,h)anthracene","ng/g",1.1862370641245013,100,10000,"Yes","Yes"]
["POCES 03","-0,063 mm","PAH","benzo(g,h,i)perylene","ng/g",13.078115620482658,100,10000,"Yes","Yes"]
["POCES 03","-0,063 mm","PAH","indeno(1,2,3,c,d)pyrene","ng/g",10.582660677269638,100,5000,"Yes","Yes"]
["POCES 03","-0,063 mm","PAH","Sum PAH","ng/g",233.42078603322724,10000,100000,"Yes","Yes"]
["POCES 03","Dredged sediment","PCB","PCB 28","ng/g",0.26903016163115978,"-","-","-","-"]
["POCES 03","Dredged sediment","PCB","PCB 52","ng/g",0.41825565369946854,"-","-","-","-"]
["POCES 03","Dredged sediment","PCB","PCB 101","ng/g",1.4473612492678072,"-","-","-","-"]
["POCES 03","Dredged sediment","PCB","PCB 81","ng/g",0,"-","-","-","-"]
["POCES 03","Dredged sediment","PCB","PCB 77","ng/g",0.43164296429733989,"-","-","-","-"]
["POCES 03","Dredged sediment","PCB","PCB123","ng/g",5.9609011679677436E-2,"-","-","-","-"]
["POCES 03","Dredged sediment","PCB","PCB 118","ng/g",0.60324285245519049,"-","-","-","-"]
["POCES 03","Dredged sediment","PCB","PCB 114","ng/g",0,"-","-","-","-"]
["POCES 03","Dredged sediment","PCB","PCB 153","ng/g",6.077119148138971,"-","-","-","-"]
["POCES 03","Dredged sediment","PCB","PCB 105","ng/g",1.0546784472834339,"-","-","-","-"]
["POCES 03","Dredged sediment","PCB","PCB 138","ng/g",3.0523009876773974,"-","-","-","-"]
["POCES 03","Dredged sediment","PCB","PCB 126","ng/g",0,"-","-","-","-"]
["POCES 03","Dredged sediment","PCB","PCB 128","ng/g",0.49077865708070961,"-","-","-","-"]
["POCES 03","Dredged sediment","PCB","PCB167","ng/g",0.10485113242262323,"-","-","-","-"]
["POCES 03","Dredged sediment","PCB","PCB 156","ng/g",0.1610035993817141,"-","-","-","-"]
["POCES 03","Dredged sediment","PCB","PCB 157","ng/g",2.7428660557316763E-2,"-","-","-","-"]
["POCES 03","Dredged sediment","PCB","PCB 180","ng/g",5.3690840890131337,"-","-","-","-"]
["POCES 03","Dredged sediment","PCB","PCB 170","ng/g",1.8353498958218761,"-","-","-","-"]
["POCES 03","Dredged sediment","PCB","PCB 169","ng/g",0,"-","-","-","-"]
["POCES 03","Dredged sediment","PCB","PCB 189","ng/g",6.7468738913466192E-2,"-","-","-","-"]
["POCES 03","Dredged sediment","PCB","PCB 209","ng/g",5.5917808477692392E-2,"-","-","-","-"]
["POCES 03","Dredged sediment","PCB","Sum PCB","ng/g",21.525123057798979,60,5000,{"$f":"IF(F1101<G1101,\"Yes\",\"No\")","v":"Yes"},{"$f":"IF(F1101<H1101,\"Yes\",\"No\")","v":"Yes"}]
["POCES 03","+0,5 mm","PCB","PCB 28","ng/g",0.40448348859456212,"-","-","-","-"]
["POCES 03","+0,5 mm","PCB","PCB 52","ng/g",0.7857458846920885,"-","-","-","-"]
["POCES 03","+0,5 mm","PCB","PCB 101","ng/g",1.3719266387039912,"-","-","-","-"]
["POCES 03","+0,5 mm","PCB","PCB 81","ng/g",0,"-","-","-","-"]
["POCES 03","+0,5 mm","PCB","PCB 77","ng/g",7.9116186888523662E-2,"-","-","-","-"]
["POCES 03","+0,5 mm","PCB","PCB123","ng/g",0.11281925877086096,"-","-","-","-"]
["POCES 03","+0,5 mm","PCB","PCB 118","ng/g",0.70581413278627625,"-","-","-","-"]
["POCES 03","+0,5 mm","PCB","PCB 114","ng/g",0,"-","-","-","-"]
["POCES 03","+0,5 mm","PCB","PCB 153","ng/g",1.9546565315106459,"-","-","-","-"]
["POCES 03","+0,5 mm","PCB","PCB 105","ng/g",0.36250090130535306,"-","-","-","-"]
["POCES 03","+0,5 mm","PCB","PCB 138","ng/g",1.5571904681968995,"-","-","-","-"]
["POCES 03","+0,5 mm","PCB","PCB 126","ng/g",0,"-","-","-","-"]
["POCES 03","+0,5 mm","PCB","PCB 128","ng/g",0.2846593475892944,"-","-","-","-"]
["POCES 03","+0,5 mm","PCB","PCB167","ng/g",9.739566624130773E-2,"-","-","-","-"]
["POCES 03","+0,5 mm","PCB","PCB 156","ng/g",0.1326202748436183,"-","-","-","-"]
["POCES 03","+0,5 mm","PCB","PCB 157","ng/g",0.14084115353278714,"-","-","-","-"]
["POCES 03","+0,5 mm","PCB","PCB 180","ng/g",0.91840428557849452,"-","-","-","-"]
["POCES 03","+0,5 mm","PCB","PCB 170","ng/g",0.31040929930551414,"-","-","-","-"]
["POCES 03","+0,5 mm","PCB","PCB 169","ng/g",0,"-","-","-","-"]
["POCES 03","+0,5 mm","PCB","PCB 189","ng/g",1.0859084474895401E-2,"-","-","-","-"]
["POCES 03","+0,5 mm","PCB","PCB 209","ng/g",2.7923360078302473E-2,"-","-","-","-"]
["POCES 03","+0,5 mm","PCB","Sum PCB","ng/g",9.2573659630934149,60,5000,{"$f":"IF(F1123<G1123,\"Yes\",\"No\")","v":"Yes"},{"$f":"IF(F1123<H1123,\"Yes\",\"No\")","v":"Yes"}]
["POCES 03","-0,5 +0,063 mm","PCB","PCB 28","ng/g",0.24836818512404829,"-","-","-","-"]
["POCES 03","-0,5 +0,063 mm","PCB","PCB 52","ng/g",0.50856586759346334,"-","-","-","-"]
["POCES 03","-0,5 +0,063 mm","PCB","PCB 101","ng/g",1.0271609175542586,"-","-","-","-"]
["POCES 03","-0,5 +0,063 mm","PCB","PCB 81","ng/g",0,"-","-","-","-"]
["POCES 03","-0,5 +0,063 mm","PCB","PCB 77","ng/g",0,"-","-","-","-"]
["POCES 03","-0,5 +0,063 mm","PCB","PCB123","ng/g",8.5610655610408481E-2,"-","-","-","-"]
["POCES 03","-0,5 +0,063 mm","PCB","PCB 118","ng/g",0.51687568334370737,"-","-","-","-"]
["POCES 03","-0,5 +0,063 mm","PCB","PCB 114","ng/g",0,"-","-","-","-"]
["POCES 03","-0,5 +0,063 mm","PCB","PCB 153","ng/g",1.7839622695725459,"-","-","-","-"]
["POCES 03","-0,5 +0,063 mm","PCB","PCB 105","ng/g",0.38439930135538813,"-","-","-","-"]
["POCES 03","-0,5 +0,063 mm","PCB","PCB 138","ng/g",1.3195152495103606,"-","-","-","-"]
["POCES 03","-0,5 +0,063 mm","PCB","PCB 126","ng/g",0,"-","-","-","-"]
["POCES 03","-0,5 +0,063 mm","PCB","PCB 128","ng/g",0.2471282044464311,"-","-","-","-"]
["POCES 03","-0,5 +0,063 mm","PCB","PCB167","ng/g",5.5116794204128128E-2,"-","-","-","-"]
["POCES 03","-0,5 +0,063 mm","PCB","PCB 156","ng/g",0.16926506158081533,"-","-","-","-"]
["POCES 03","-0,5 +0,063 mm","PCB","PCB 157","ng/g",5.3653774055957476E-2,"-","-","-","-"]
["POCES 03","-0,5 +0,063 mm","PCB","PCB 180","ng/g",1.0892309525377206,"-","-","-","-"]
["POCES 03","-0,5 +0,063 mm","PCB","PCB 170","ng/g",0.42442925475779092,"-","-","-","-"]
["POCES 03","-0,5 +0,063 mm","PCB","PCB 169","ng/g",0,"-","-","-","-"]
["POCES 03","-0,5 +0,063 mm","PCB","PCB 189","ng/g",0,"-","-","-","-"]
["POCES 03","-0,5 +0,063 mm","PCB","PCB 209","ng/g",1.7600200320786664E-2,"-","-","-","-"]
["POCES 03","-0,5 +0,063 mm","PCB","Sum PCB","ng/g",7.9308823715678107,60,5000,{"$f":"IF(F1145<G1145,\"Yes\",\"No\")","v":"Yes"},{"$f":"IF(F1145<H1145,\"Yes\",\"No\")","v":"Yes"}]
["POCES 03","-0,063 mm","PCB","PCB 28","ng/g",0.5079430291191851,"-","-","-","-"]
["POCES 03","-0,063 mm","PCB","PCB 52","ng/g",0.84220596267397241,"-","-","-","-"]
["POCES 03","-0,063 mm","PCB","PCB 101","ng/g",1.4425623913677708,"-","-","-","-"]
["POCES 03","-0,063 mm","PCB","PCB 81","ng/g",0,"-","-","-","-"]
["POCES 03","-0,063 mm","PCB","PCB 77","ng/g",5.9952525116040607E-2,"-","-","-","-"]
["POCES 03","-0,063 mm","PCB","PCB123","ng/g",0.11653039575974228,"-","-","-","-"]
["POCES 03","-0,063 mm","PCB","PCB 118","ng/g",0.86180709497895192,"-","-","-","-"]
["POCES 03","-0,063 mm","PCB","PCB 114","ng/g",5.7097642967657717E-3,"-","-","-","-"]
["POCES 03","-0,063 mm","PCB","PCB 153","ng/g",2.0095614790056939,"-","-","-","-"]
["POCES 03","-0,063 mm","PCB","PCB 105","ng/g",0.50280307862126572,"-","-","-","-"]
["POCES 03","-0,063 mm","PCB","PCB 138","ng/g",2.5975542570165122,"-","-","-","-"]
["POCES 03","-0,063 mm","PCB","PCB 126","ng/g",0,"-","-","-","-"]
["POCES 03","-0,063 mm","PCB","PCB 128","ng/g",0.31828925096917576,"-","-","-","-"]
["POCES 03","-0,063 mm","PCB","PCB167","ng/g",5.6512443891326057E-2,"-","-","-","-"]
["POCES 03","-0,063 mm","PCB","PCB 156","ng/g",0.18702229899537506,"-","-","-","-"]
["POCES 03","-0,063 mm","PCB","PCB 157","ng/g",2.8059078473570254E-2,"-","-","-","-"]
["POCES 03","-0,063 mm","PCB","PCB 180","ng/g",0.87891606963736668,"-","-","-","-"]
["POCES 03","-0,063 mm","PCB","PCB 170","ng/g",0.38434108397637462,"-","-","-","-"]
["POCES 03","-0,063 mm","PCB","PCB 169","ng/g",0,"-","-","-","-"]
["POCES 03","-0,063 mm","PCB","PCB 189","ng/g",1.4275978648209009E-2,"-","-","-","-"]
["POCES 03","-0,063 mm","PCB","PCB 209","ng/g",4.8717696519015925E-2,"-","-","-","-"]
["POCES 03","-0,063 mm","PCB","Sum PCB","ng/g",10.862763879066316,60,5000,{"$f":"IF(F1167<G1167,\"Yes\",\"No\")","v":"Yes"},{"$f":"IF(F1167<H1167,\"Yes\",\"No\")","v":"Yes"}]
["POCES 03","Dredged sediment","Hydrocarbons (C > 12 mg/kg)",null,"mg/kg",23,50,750,{"$f":"IF(F1168<G1168,\"Yes\",\"No\")","v":"Yes"},{"$f":"IF(F1168<H1168,\"Yes\",\"No\")","v":"Yes"}]
["POCES 03","-0,5 +0,063 mm","Hydrocarbons (C > 12 mg/kg)",null,"mg/kg",31,50,750,{"$f":"IF(F1169<G1169,\"Yes\",\"No\")","v":"Yes"},{"$f":"IF(F1169<H1169,\"Yes\",\"No\")","v":"Yes"}]
["POCES 03","-0,063 mm","Hydrocarbons (C > 12 mg/kg)",null,"mg/kg",43,50,750,{"$f":"IF(F1170<G1170,\"Yes\",\"No\")","v":"Yes"},{"$f":"IF(F1170<H1170,\"Yes\",\"No\")","v":"Yes"}]
["POCES 03","Dredged sediment","Tributyltin ",null,"μg/kg",3,null,null,null,null,"*D. Lgs. 152/06: environmental quality standards in sediments expressed as the annual average   (SQA-MA) = 5 µg/kg SS * "]
["POCES 03","-0,5 +0,063 mm","Tributyltin ",null,"μg/kg",2.2000000000000002]
["POCES 03","-0,063 mm","Tributyltin ",null,"μg/kg",1.5]
["POCES 03","Dredged sediment","Pesticides","HCB","ng/g",null,50,5000]
["POCES 03","Dredged sediment","Pesticides","a-HCH","ng/g",null,"-","-","-","-"]
["POCES 03","Dredged sediment","Pesticides","b-HCH","ng/g",null,"-","-","-","-"]
["POCES 03","Dredged sediment","Pesticides","g-HCH","ng/g",null,"-","-","-","-"]
["POCES 03","Dredged sediment","Pesticides","Aldrin","ng/g",null,10,100]
["POCES 03","Dredged sediment","Pesticides","o,p` DDE","ng/g",null,10,100,{"$f":"IF(F1179<G1179,\"Yes\",\"No\")","v":"Yes"},{"$f":"IF(F1179<H1179,\"Yes\",\"No\")","v":"Yes"}]
["POCES 03","Dredged sediment","Pesticides","g-chlordane","ng/g",null,null,null,"-","-"]
["POCES 03","Dredged sediment","Pesticides","a-chlordane","ng/g",null,null,null,"-","-"]
["POCES 03","Dredged sediment","Pesticides","p,p`DDE","ng/g",null,10,100,{"$f":"IF(F1182<G1182,\"Yes\",\"No\")","v":"Yes"},{"$f":"IF(F1182<H1182,\"Yes\",\"No\")","v":"Yes"}]
["POCES 03","Dredged sediment","Pesticides","Dieldrin","ng/g",null,10,100]
["POCES 03","Dredged sediment","Pesticides","o,p`DDD","ng/g",null,10,100,{"$f":"IF(F1184<G1184,\"Yes\",\"No\")","v":"Yes"},{"$f":"IF(F1184<H1184,\"Yes\",\"No\")","v":"Yes"}]
["POCES 03","Dredged sediment","Pesticides","Endrin","ng/g",null,10,2000]
["POCES 03","Dredged sediment","Pesticides","o,p`DDT","ng/g",null,10,100,{"$f":"IF(F1186<G1186,\"Yes\",\"No\")","v":"Yes"},{"$f":"IF(F1186<H1186,\"Yes\",\"No\")","v":"Yes"}]
["POCES 03","Dredged sediment","Pesticides","p,p`DDD","ng/g",null,10,100,"Yes","Yes"]
["POCES 03","Dredged sediment","Pesticides","p,p`DDT","ng/g",null,10,100,"Yes","Yes"]
["POCES 03","+0,5 mm","Pesticides","HCB","ng/g",null,50,5000,{"$f":"IF(F1189<G1189,\"Yes\",\"No\")","v":"Yes"},{"$f":"IF(F1189<H1189,\"Yes\",\"No\")","v":"Yes"}]
["POCES 03","+0,5 mm","Pesticides","a-HCH","ng/g",null,"-","-","-","-"]
["POCES 03","+0,5 mm","Pesticides","b-HCH","ng/g",null,"-","-","-","-"]
["POCES 03","+0,5 mm","Pesticides","g-HCH","ng/g",null,"-","-","-","-"]
["POCES 03","+0,5 mm","Pesticides","Aldrin","ng/g",null,10,100]
["POCES 03","+0,5 mm","Pesticides","o,p` DDE","ng/g",null,10,100,{"$f":"IF(F1194<G1194,\"Yes\",\"No\")","v":"Yes"},{"$f":"IF(F1194<H1194,\"Yes\",\"No\")","v":"Yes"}]
["POCES 03","+0,5 mm","Pesticides","g-chlordane","ng/g",null,null,null,"-","-"]
["POCES 03","+0,5 mm","Pesticides","a-chlordane","ng/g",null,null,null,"-","-"]
["POCES 03","+0,5 mm","Pesticides","p,p`DDE","ng/g",null,10,100,{"$f":"IF(F1197<G1197,\"Yes\",\"No\")","v":"Yes"},{"$f":"IF(F1197<H1197,\"Yes\",\"No\")","v":"Yes"}]
["POCES 03","+0,5 mm","Pesticides","Dieldrin","ng/g",null,10,100]
["POCES 03","+0,5 mm","Pesticides","o,p`DDD","ng/g",null,10,100,{"$f":"IF(F1199<G1199,\"Yes\",\"No\")","v":"Yes"},{"$f":"IF(F1199<H1199,\"Yes\",\"No\")","v":"Yes"}]
["POCES 03","+0,5 mm","Pesticides","Endrin","ng/g",null,10,2000]
["POCES 03","+0,5 mm","Pesticides","o,p`DDT","ng/g",null,10,100,{"$f":"IF(F1201<G1201,\"Yes\",\"No\")","v":"Yes"},{"$f":"IF(F1201<H1201,\"Yes\",\"No\")","v":"Yes"}]
["POCES 03","+0,5 mm","Pesticides","p,p`DDD","ng/g",null,10,100,"Yes","Yes"]
["POCES 03","+0,5 mm","Pesticides","p,p`DDT","ng/g",null,10,100,"Yes","Yes"]
["POCES 03","-0,5 +0,063 mm","Pesticides","HCB","ng/g",null,50,5000,{"$f":"IF(F1204<G1204,\"Yes\",\"No\")","v":"Yes"},{"$f":"IF(F1204<H1204,\"Yes\",\"No\")","v":"Yes"}]
["POCES 03","-0,5 +0,063 mm","Pesticides","a-HCH","ng/g",null,"-","-","-","-"]
["POCES 03","-0,5 +0,063 mm","Pesticides","b-HCH","ng/g",null,"-","-","-","-"]
["POCES 03","-0,5 +0,063 mm","Pesticides","g-HCH","ng/g",null,"-","-","-","-"]
["POCES 03","-0,5 +0,063 mm","Pesticides","Aldrin","ng/g",null,10,100]
["POCES 03","-0,5 +0,063 mm","Pesticides","o,p` DDE","ng/g",null,10,100]
["POCES 03","-0,5 +0,063 mm","Pesticides","g-chlordane","ng/g",null,null,null,"-","-"]
["POCES 03","-0,5 +0,063 mm","Pesticides","a-chlordane","ng/g",null,null,null,"-","-"]
["POCES 03","-0,5 +0,063 mm","Pesticides","p,p`DDE","ng/g",null,10,100,{"$f":"IF(F1212<G1212,\"Yes\",\"No\")","v":"Yes"},{"$f":"IF(F1212<H1212,\"Yes\",\"No\")","v":"Yes"}]
["POCES 03","-0,5 +0,063 mm","Pesticides","Dieldrin","ng/g",null,10,100]
["POCES 03","-0,5 +0,063 mm","Pesticides","o,p`DDD","ng/g",null,10,100,{"$f":"IF(F1214<G1214,\"Yes\",\"No\")","v":"Yes"},{"$f":"IF(F1214<H1214,\"Yes\",\"No\")","v":"Yes"}]
["POCES 03","-0,5 +0,063 mm","Pesticides","Endrin","ng/g",null,10,2000]
["POCES 03","-0,5 +0,063 mm","Pesticides","o,p`DDT","ng/g",null,10,100]
["POCES 03","-0,5 +0,063 mm","Pesticides","p,p`DDD","ng/g",null,10,100,{"$f":"IF(F1217<G1217,\"Yes\",\"No\")","v":"Yes"},{"$f":"IF(F1217<H1217,\"Yes\",\"No\")","v":"Yes"}]
["POCES 03","-0,5 +0,063 mm","Pesticides","p,p`DDT","ng/g",null,10,100,"Yes","Yes"]
["POCES 03","-0,063 mm","Pesticides","HCB","ng/g",null,50,5000,{"$f":"IF(F1219<G1219,\"Yes\",\"No\")","v":"Yes"},{"$f":"IF(F1219<H1219,\"Yes\",\"No\")","v":"Yes"}]
["POCES 03","-0,063 mm","Pesticides","a-HCH","ng/g",null,"-","-","-","-"]
["POCES 03","-0,063 mm","Pesticides","b-HCH","ng/g",null,"-","-","-","-"]
["POCES 03","-0,063 mm","Pesticides","g-HCH","ng/g",null,"-","-","-","-"]
["POCES 03","-0,063 mm","Pesticides","Aldrin","ng/g",null,10,100]
["POCES 03","-0,063 mm","Pesticides","o,p` DDE","ng/g",null,10,100,{"$f":"IF(F1224<G1224,\"Yes\",\"No\")","v":"Yes"},{"$f":"IF(F1224<H1224,\"Yes\",\"No\")","v":"Yes"}]
["POCES 03","-0,063 mm","Pesticides","g-chlordane","ng/g",null,null,null,"-","-"]
["POCES 03","-0,063 mm","Pesticides","a-chlordane","ng/g",null,null,null,"-","-"]
["POCES 03","-0,063 mm","Pesticides","p,p`DDE","ng/g",null,10,100,{"$f":"IF(F1227<G1227,\"Yes\",\"No\")","v":"Yes"},{"$f":"IF(F1227<H1227,\"Yes\",\"No\")","v":"Yes"}]
["POCES 03","-0,063 mm","Pesticides","Dieldrin","ng/g",null,10,100]
["POCES 03","-0,063 mm","Pesticides","o,p`DDD","ng/g",null,10,100,{"$f":"IF(F1229<G1229,\"Yes\",\"No\")","v":"Yes"},{"$f":"IF(F1229<H1229,\"Yes\",\"No\")","v":"Yes"}]
["POCES 03","-0,063 mm","Pesticides","Endrin","ng/g",null,10,2000]
["POCES 03","-0,063 mm","Pesticides","o,p`DDT","ng/g",null,10,100,{"$f":"IF(F1231<G1231,\"Yes\",\"No\")","v":"Yes"},{"$f":"IF(F1231<H1231,\"Yes\",\"No\")","v":"Yes"}]
["POCES 03","-0,063 mm","Pesticides","p,p`DDD","ng/g",null,10,100,"Yes","Yes"]
["POCES 03","-0,063 mm","Pesticides","p,p`DDT","ng/g",null,10,100,"Yes","Yes"]
["BELLARIA 03","+0,5 mm","Granulometric Analysis",null,"%",15.18]
["BELLARIA 03","-0,5 +0,063 mm","Granulometric Analysis",null,"%",83.12]
["BELLARIA 03","-0,063 mm","Granulometric Analysis",null,"%",1.7]
["BELLARIA 03","Dredged sediment","Shepard classification",null,null,"Sand"]
["BELLARIA 03","Dredged sediment","Nota classification",null,null,"Sand"]
["BELLARIA 03","Dredged sediment","VS (%TS)",null,"%",2.4500000000000002]
["BELLARIA 03","-0,5 +0,063 mm","VS (%TS)",null,"%",1.26]
["BELLARIA 03","Dredged sediment","TC (%TS)",null,"%",5.85]
["BELLARIA 03","-0,5 +0,063 mm","TC (%TS)",null,"%",5.74]
["BELLARIA 03","Dredged sediment","IC (%TS)",null,"%",3.03]
["BELLARIA 03","-0,5 +0,063 mm","IC (%TS)",null,"%",3.9]
["BELLARIA 03","Dredged sediment","TOC (%TS)",null,"%",2.82]
["BELLARIA 03","-0,5 +0,063 mm","TOC (%TS)",null,"%",1.84]
["BELLARIA 03","Dredged sediment","O2 consumption (840 h)",null,"(mg O2/kg TS)",64712.21]
["BELLARIA 03","-0,5 +0,063 mm","O2 consumption (840 h)",null,"(mg O2/kg TS)",677.95]
["BELLARIA 03","Dredged sediment","METALS","Zn ","mg/kg",65.324999999999989,150,1500,{"$f":"IF(F1249<G1249,\"Yes\",\"No\")","v":"Yes"},{"$f":"IF(F1249<H1249,\"Yes\",\"No\")","v":"Yes"}]
["BELLARIA 03","Dredged sediment","METALS","Ni","mg/kg",31.949999999999996,120,500,{"$f":"IF(F1250<G1250,\"Yes\",\"No\")","v":"Yes"},{"$f":"IF(F1250<H1250,\"Yes\",\"No\")","v":"Yes"}]
["BELLARIA 03","Dredged sediment","METALS","Cr","mg/kg",53.904999999999994,150,800,"Yes","Yes"]
["BELLARIA 03","Dredged sediment","METALS","Pb","mg/kg",31.36,100,1000,"Yes","Yes"]
["BELLARIA 03","Dredged sediment","METALS","As","mg/kg",10.844999999999999,20,50,"Yes","Yes"]
["BELLARIA 03","Dredged sediment","METALS","Cd","mg/kg",0.48,2,15,"Yes","Yes"]
["BELLARIA 03","Dredged sediment","METALS","Cu","mg/kg",13.984999999999999,120,600,"Yes","Yes"]
["BELLARIA 03","Dredged sediment","METALS","V","mg/kg",56.935000000000002,90,250,"Yes","Yes"]
["BELLARIA 03","Dredged sediment","METALS","Hg","mg/kg",8.3000000000000001E-3,1,5,{"$f":"IF(F1257<G1257,\"Yes\",\"No\")","v":"Yes"},{"$f":"IF(F1257<H1257,\"Yes\",\"No\")","v":"Yes"}]
["BELLARIA 03","-1 +0,5 mm","METALS","Zn ","mg/kg",45.314999999999998,150,1500,"Yes","Yes"]
["BELLARIA 03","-1 +0,5 mm","METALS","Ni","mg/kg",35.935000000000002,120,500,"Yes","Yes"]
["BELLARIA 03","-1 +0,5 mm","METALS","Cr","mg/kg",23.954999999999998,150,800,"Yes","Yes"]
["BELLARIA 03","-1 +0,5 mm","METALS","Pb","mg/kg",16.335000000000001,100,1000,"Yes","Yes"]
["BELLARIA 03","-1 +0,5 mm","METALS","As","mg/kg",5.61,20,50,"Yes","Yes"]
["BELLARIA 03","-1 +0,5 mm","METALS","Cd","mg/kg",0.16,2,15,"Yes","Yes"]
["BELLARIA 03","-1 +0,5 mm","METALS","Cu","mg/kg",9.9849999999999994,120,600,"Yes","Yes"]
["BELLARIA 03","-1 +0,5 mm","METALS","V","mg/kg",null,90,250,"Yes","Yes"]
["BELLARIA 03","-1 +0,5 mm","METALS","Hg","mg/kg",7.6E-3,1,5,{"$f":"IF(F1266<G1266,\"Yes\",\"No\")","v":"Yes"},{"$f":"IF(F1266<H1266,\"Yes\",\"No\")","v":"Yes"}]
["BELLARIA 03","-0,5 +0,063 mm","METALS","Zn ","mg/kg",63.5,150,1500,"Yes","Yes"]
["BELLARIA 03","-0,5 +0,063 mm","METALS","Ni","mg/kg",35.945,120,500,"Yes","Yes"]
["BELLARIA 03","-0,5 +0,063 mm","METALS","Cr","mg/kg",87.860000000000014,150,800,"Yes","Yes"]
["BELLARIA 03","-0,5 +0,063 mm","METALS","Pb","mg/kg",32.99,100,1000,"Yes","Yes"]
["BELLARIA 03","-0,5 +0,063 mm","METALS","As","mg/kg",8.8649999999999984,20,50,"Yes","Yes"]
["BELLARIA 03","-0,5 +0,063 mm","METALS","Cd","mg/kg",0.45999999999999996,2,15,"Yes","Yes"]
["BELLARIA 03","-0,5 +0,063 mm","METALS","Cu","mg/kg",11.98,120,600,"Yes","Yes"]
["BELLARIA 03","-0,5 +0,063 mm","METALS","V","mg/kg",43.68,90,250,"Yes","Yes"]
["BELLARIA 03","-0,5 +0,063 mm","METALS","Hg","mg/kg",8.72E-2,1,5,{"$f":"IF(F1275<G1275,\"Yes\",\"No\")","v":"Yes"},{"$f":"IF(F1275<H1275,\"Yes\",\"No\")","v":"Yes"}]
["BELLARIA 03","-0,063 mm","METALS","Zn ","mg/kg",156.57499999999999,150,1500,{"$f":"IF(F1276<G1276,\"Yes\",\"No\")","v":"No"},"Yes"]
["BELLARIA 03","-0,063 mm","METALS","Ni","mg/kg",61.835000000000001,120,500,{"$f":"IF(F1277<G1277,\"Yes\",\"No\")","v":"Yes"},"Yes"]
["BELLARIA 03","-0,063 mm","METALS","Cr","mg/kg",81.78,150,800,"Yes","Yes"]
["BELLARIA 03","-0,063 mm","METALS","Pb","mg/kg",27.605,100,1000,"Yes","Yes"]
["BELLARIA 03","-0,063 mm","METALS","As","mg/kg",18.490000000000002,20,50,"Yes","Yes"]
["BELLARIA 03","-0,063 mm","METALS","Cd","mg/kg",0.30000000000000004,2,15,"Yes","Yes"]
["BELLARIA 03","-0,063 mm","METALS","Cu","mg/kg",31.91,120,600,"Yes","Yes"]
["BELLARIA 03","-0,063 mm","METALS","V","mg/kg",200.95499999999998,90,250,{"$f":"IF(F1283<G1283,\"Yes\",\"No\")","v":"No"},{"$f":"IF(F1283<H1283,\"Yes\",\"No\")","v":"Yes"}]
["BELLARIA 03","-0,063 mm","METALS","Hg","mg/kg",1.7999999999999999E-2,1,5,"Yes","Yes"]
["BELLARIA 03","Dredged sediment","PAH","naphthalene ","ng/g","<LOQ","-","-","-","-"]
["BELLARIA 03","Dredged sediment","PAH","acenaphthene","ng/g","<LOQ","-","-","-","-"]
["BELLARIA 03","Dredged sediment","PAH","fluorene","ng/g","<LOQ","-","-","-","-"]
["BELLARIA 03","Dredged sediment","PAH","phenanthrene","ng/g",5.8397417033120336,"-","-","-","-"]
["BELLARIA 03","Dredged sediment","PAH","anthracene","ng/g","<LOQ","-","-","-","-"]
["BELLARIA 03","Dredged sediment","PAH","fluoranthene","ng/g",3.3103879216054981,"-","-","-","-"]
["BELLARIA 03","Dredged sediment","PAH","pyrene","ng/g",3.2910449686183298,5000,50000,{"$f":"IF(F1291<G1291,\"Yes\",\"No\")","v":"Yes"},{"$f":"IF(F1291<H1291,\"Yes\",\"No\")","v":"Yes"}]
["BELLARIA 03","Dredged sediment","PAH","benzo(a)anthracene","ng/g",0.71171573854536307,500,10000,{"$f":"IF(F1292<G1292,\"Yes\",\"No\")","v":"Yes"},{"$f":"IF(F1292<H1292,\"Yes\",\"No\")","v":"Yes"}]
["BELLARIA 03","Dredged sediment","PAH","chrysene","ng/g",1.2752449739763598,5000,50000,"Yes","Yes"]
["BELLARIA 03","Dredged sediment","PAH","benzo(b)fluoranthene","ng/g",2.1648213732449832,500,10000,"Yes","Yes"]
["BELLARIA 03","Dredged sediment","PAH","benzo(k)fluoranthene","ng/g",0.59967613357843685,500,10000,"Yes","Yes"]
["BELLARIA 03","Dredged sediment","PAH","benzo(a)pyrene","ng/g",1.0858131752261881,100,10000,"Yes","Yes"]
["BELLARIA 03","Dredged sediment","PAH","dibenzo(a,h)anthracene","ng/g","<LOQ",100,10000,"Yes","Yes"]
["BELLARIA 03","Dredged sediment","PAH","benzo(g,h,i)perylene","ng/g",2.2464519251173969,100,10000,"Yes","Yes"]
["BELLARIA 03","Dredged sediment","PAH","indeno(1,2,3,c,d)pyrene","ng/g",0.78078718141949777,100,5000,"Yes","Yes"]
["BELLARIA 03","Dredged sediment","PAH","Sum PAH","ng/g",21.30568509464409,10000,100000,"Yes","Yes"]
["BELLARIA 03","-1 +0,5 mm","PAH","naphthalene ","ng/g",1.5018190472373301,"-","-","-","-"]
["BELLARIA 03","-1 +0,5 mm","PAH","acenaphthene","ng/g","<LOQ","-","-","-","-"]
["BELLARIA 03","-1 +0,5 mm","PAH","fluorene","ng/g","<LOQ","-","-","-","-"]
["BELLARIA 03","-1 +0,5 mm","PAH","phenanthrene","ng/g",4.1362777700520788,"-","-","-","-"]
["BELLARIA 03","-1 +0,5 mm","PAH","anthracene","ng/g","<LOQ","-","-","-","-"]
["BELLARIA 03","-1 +0,5 mm","PAH","fluoranthene","ng/g",1.4779479242712756,"-","-","-","-"]
["BELLARIA 03","-1 +0,5 mm","PAH","pyrene","ng/g",1.0793545054586957,5000,50000,{"$f":"IF(F1307<G1307,\"Yes\",\"No\")","v":"Yes"},{"$f":"IF(F1307<H1307,\"Yes\",\"No\")","v":"Yes"}]
["BELLARIA 03","-1 +0,5 mm","PAH","benzo(a)anthracene","ng/g","<LOQ",500,10000,"Yes","Yes"]
["BELLARIA 03","-1 +0,5 mm","PAH","chrysene","ng/g","<LOQ",5000,50000,"Yes","Yes"]
["BELLARIA 03","-1 +0,5 mm","PAH","benzo(b)fluoranthene","ng/g",0.64816793995639521,500,10000,{"$f":"IF(F1310<G1310,\"Yes\",\"No\")","v":"Yes"},{"$f":"IF(F1310<H1310,\"Yes\",\"No\")","v":"Yes"}]
["BELLARIA 03","-1 +0,5 mm","PAH","benzo(k)fluoranthene","ng/g","<LOQ",500,10000,"Yes","Yes"]
["BELLARIA 03","-1 +0,5 mm","PAH","benzo(a)pyrene","ng/g","<LOQ",100,10000,"Yes","Yes"]
["BELLARIA 03","-1 +0,5 mm","PAH","dibenzo(a,h)anthracene","ng/g","<LOQ",100,10000,"Yes","Yes"]
["BELLARIA 03","-1 +0,5 mm","PAH","benzo(g,h,i)perylene","ng/g","<LOQ",100,10000,"Yes","Yes"]
["BELLARIA 03","-1 +0,5 mm","PAH","indeno(1,2,3,c,d)pyrene","ng/g","<LOQ",100,5000,"Yes","Yes"]
["BELLARIA 03","-1 +0,5 mm","PAH","Sum PAH","ng/g",8.8435671869757755,10000,100000,"Yes","Yes"]
["BELLARIA 03","-0,5 +0,063 mm","PAH","naphthalene ","ng/g",2.0948277260811636,"-","-","-","-"]
["BELLARIA 03","-0,5 +0,063 mm","PAH","acenaphthene","ng/g","<LOQ","-","-","-","-"]
["BELLARIA 03","-0,5 +0,063 mm","PAH","fluorene","ng/g","<LOQ","-","-","-","-"]
["BELLARIA 03","-0,5 +0,063 mm","PAH","phenanthrene","ng/g",3.0541068449678628,"-","-","-","-"]
["BELLARIA 03","-0,5 +0,063 mm","PAH","anthracene","ng/g","<LOQ","-","-","-","-"]
["BELLARIA 03","-0,5 +0,063 mm","PAH","fluoranthene","ng/g",3.100017474587049,"-","-","-","-"]
["BELLARIA 03","-0,5 +0,063 mm","PAH","pyrene","ng/g",3.6244304438742252,5000,50000,{"$f":"IF(F1323<G1323,\"Yes\",\"No\")","v":"Yes"},{"$f":"IF(F1323<H1323,\"Yes\",\"No\")","v":"Yes"}]
["BELLARIA 03","-0,5 +0,063 mm","PAH","benzo(a)anthracene","ng/g",1.3766801366384902,500,10000,{"$f":"IF(F1324<G1324,\"Yes\",\"No\")","v":"Yes"},{"$f":"IF(F1324<H1324,\"Yes\",\"No\")","v":"Yes"}]
["BELLARIA 03","-0,5 +0,063 mm","PAH","chrysene","ng/g",1.7951891446290493,5000,50000,"Yes","Yes"]
["BELLARIA 03","-0,5 +0,063 mm","PAH","benzo(b)fluoranthene","ng/g",2.7027529508740686,500,10000,"Yes","Yes"]
["BELLARIA 03","-0,5 +0,063 mm","PAH","benzo(k)fluoranthene","ng/g",0.83691151659861385,500,10000,"Yes","Yes"]
["BELLARIA 03","-0,5 +0,063 mm","PAH","benzo(a)pyrene","ng/g",1.4992904467748336,100,10000,"Yes","Yes"]
["BELLARIA 03","-0,5 +0,063 mm","PAH","dibenzo(a,h)anthracene","ng/g","<LOQ",100,10000,"Yes","Yes"]
["BELLARIA 03","-0,5 +0,063 mm","PAH","benzo(g,h,i)perylene","ng/g",2.2931367782024807,100,10000,{"$f":"IF(F1330<G1330,\"Yes\",\"No\")","v":"Yes"},{"$f":"IF(F1330<H1330,\"Yes\",\"No\")","v":"Yes"}]
["BELLARIA 03","-0,5 +0,063 mm","PAH","indeno(1,2,3,c,d)pyrene","ng/g","<LOQ",100,5000,"Yes","Yes"]
["BELLARIA 03","-0,5 +0,063 mm","PAH","Sum PAH","ng/g",22.377343463227835,10000,100000,"Yes","Yes"]
["BELLARIA 03","-0,063 mm","PAH","naphthalene ","ng/g",11.246153776037426,"-","-","-","-"]
["BELLARIA 03","-0,063 mm","PAH","acenaphthene","ng/g",1.0647380763253105,"-","-","-","-"]
["BELLARIA 03","-0,063 mm","PAH","fluorene","ng/g",2.9888580194914462,"-","-","-","-"]
["BELLARIA 03","-0,063 mm","PAH","phenanthrene","ng/g",67.062641192651668,"-","-","-","-"]
["BELLARIA 03","-0,063 mm","PAH","anthracene","ng/g",2.9658047867577539,"-","-","-","-"]
["BELLARIA 03","-0,063 mm","PAH","fluoranthene","ng/g",123.98405779951035,"-","-","-","-"]
["BELLARIA 03","-0,063 mm","PAH","pyrene","ng/g",84.631459755921696,5000,50000,{"$f":"IF(F1339<G1339,\"Yes\",\"No\")","v":"Yes"},{"$f":"IF(F1339<H1339,\"Yes\",\"No\")","v":"Yes"}]
["BELLARIA 03","-0,063 mm","PAH","benzo(a)anthracene","ng/g",17.092004402411629,500,10000,{"$f":"IF(F1340<G1340,\"Yes\",\"No\")","v":"Yes"},{"$f":"IF(F1340<H1340,\"Yes\",\"No\")","v":"Yes"}]
["BELLARIA 03","-0,063 mm","PAH","chrysene","ng/g",32.957917649119409,5000,50000,"Yes","Yes"]
["BELLARIA 03","-0,063 mm","PAH","benzo(b)fluoranthene","ng/g",41.145398030500495,500,10000,"Yes","Yes"]
["BELLARIA 03","-0,063 mm","PAH","benzo(k)fluoranthene","ng/g",15.52716561628611,500,10000,"Yes","Yes"]
["BELLARIA 03","-0,063 mm","PAH","benzo(a)pyrene","ng/g",25.283523543933601,100,10000,"Yes","Yes"]
["BELLARIA 03","-0,063 mm","PAH","dibenzo(a,h)anthracene","ng/g",3.8600136479975178,100,10000,"Yes","Yes"]
["BELLARIA 03","-0,063 mm","PAH","benzo(g,h,i)perylene","ng/g",24.455273588867492,100,10000,"Yes","Yes"]
["BELLARIA 03","-0,063 mm","PAH","indeno(1,2,3,c,d)pyrene","ng/g",24.833289018348577,100,5000,"Yes","Yes"]
["BELLARIA 03","-0,063 mm","PAH","Sum PAH","ng/g",479.09829890416046,10000,100000,"Yes","Yes"]
["BELLARIA 03","Dredged sediment","PCB","PCB 28","ng/g","<LOQ","-","-","-","-"]
["BELLARIA 03","Dredged sediment","PCB","PCB 52","ng/g",6.2689668876798998E-2,"-","-","-","-"]
["BELLARIA 03","Dredged sediment","PCB","PCB 101","ng/g",0.11811138940570512,"-","-","-","-"]
["BELLARIA 03","Dredged sediment","PCB","PCB 81","ng/g","<LOQ","-","-","-","-"]
["BELLARIA 03","Dredged sediment","PCB","PCB 77","ng/g","<LOQ","-","-","-","-"]
["BELLARIA 03","Dredged sediment","PCB","PCB123","ng/g","<LOQ","-","-","-","-"]
["BELLARIA 03","Dredged sediment","PCB","PCB 118","ng/g",6.0899508493346646E-2,"-","-","-","-"]
["BELLARIA 03","Dredged sediment","PCB","PCB 114","ng/g","<LOQ","-","-","-","-"]
["BELLARIA 03","Dredged sediment","PCB","PCB 153","ng/g",0.13085712571803854,"-","-","-","-"]
["BELLARIA 03","Dredged sediment","PCB","PCB 105","ng/g","<LOQ","-","-","-","-"]
["BELLARIA 03","Dredged sediment","PCB","PCB 138","ng/g",9.0507835955335542E-2,"-","-","-","-"]
["BELLARIA 03","Dredged sediment","PCB","PCB 126","ng/g","<LOQ","-","-","-","-"]
["BELLARIA 03","Dredged sediment","PCB","PCB 128","ng/g","<LOQ","-","-","-","-"]
["BELLARIA 03","Dredged sediment","PCB","PCB167","ng/g","<LOQ","-","-","-","-"]
["BELLARIA 03","Dredged sediment","PCB","PCB 156","ng/g","<LOQ","-","-","-","-"]
["BELLARIA 03","Dredged sediment","PCB","PCB 157","ng/g","<LOQ","-","-","-","-"]
["BELLARIA 03","Dredged sediment","PCB","PCB 180","ng/g","<LOQ","-","-","-","-"]
["BELLARIA 03","Dredged sediment","PCB","PCB 170","ng/g","<LOQ","-","-","-","-"]
["BELLARIA 03","Dredged sediment","PCB","PCB 169","ng/g","<LOQ","-","-","-","-"]
["BELLARIA 03","Dredged sediment","PCB","PCB 189","ng/g","<LOQ","-","-","-","-"]
["BELLARIA 03","Dredged sediment","PCB","PCB 209","ng/g","<LOQ","-","-","-","-"]
["BELLARIA 03","Dredged sediment","PCB","Sum PCB","ng/g",0.46306552844922488,60,5000,{"$f":"IF(F1370<G1370,\"Yes\",\"No\")","v":"Yes"},{"$f":"IF(F1370<H1370,\"Yes\",\"No\")","v":"Yes"}]
["BELLARIA 03","Dredged sediment","PCB","CB 110","ng/g",0.10525834627928823,"-","-","-","-"]
["BELLARIA 03","-1 +0,5 mm","PCB","PCB 28","ng/g","<LOQ","-","-","-","-"]
["BELLARIA 03","-1 +0,5 mm","PCB","PCB 52","ng/g",7.8660506913334871E-2,"-","-","-","-"]
["BELLARIA 03","-1 +0,5 mm","PCB","PCB 101","ng/g",7.1509551739395369E-2,"-","-","-","-"]
["BELLARIA 03","-1 +0,5 mm","PCB","PCB 81","ng/g","<LOQ","-","-","-","-"]
["BELLARIA 03","-1 +0,5 mm","PCB","PCB 77","ng/g","<LOQ","-","-","-","-"]
["BELLARIA 03","-1 +0,5 mm","PCB","PCB123","ng/g","<LOQ","-","-","-","-"]
["BELLARIA 03","-1 +0,5 mm","PCB","PCB 118","ng/g","<LOQ","-","-","-","-"]
["BELLARIA 03","-1 +0,5 mm","PCB","PCB 114","ng/g","<LOQ","-","-","-","-"]
["BELLARIA 03","-1 +0,5 mm","PCB","PCB 153","ng/g",0.14659458106576045,"-","-","-","-"]
["BELLARIA 03","-1 +0,5 mm","PCB","PCB 105","ng/g","<LOQ","-","-","-","-"]
["BELLARIA 03","-1 +0,5 mm","PCB","PCB 138","ng/g",7.1509551739395369E-2,"-","-","-","-"]
["BELLARIA 03","-1 +0,5 mm","PCB","PCB 126","ng/g","<LOQ","-","-","-","-"]
["BELLARIA 03","-1 +0,5 mm","PCB","PCB 128","ng/g","<LOQ","-","-","-","-"]
["BELLARIA 03","-1 +0,5 mm","PCB","PCB167","ng/g","<LOQ","-","-","-","-"]
["BELLARIA 03","-1 +0,5 mm","PCB","PCB 156","ng/g","<LOQ","-","-","-","-"]
["BELLARIA 03","-1 +0,5 mm","PCB","PCB 157","ng/g","<LOQ","-","-","-","-"]
["BELLARIA 03","-1 +0,5 mm","PCB","PCB 180","ng/g","<LOQ","-","-","-","-"]
["BELLARIA 03","-1 +0,5 mm","PCB","PCB 170","ng/g","<LOQ","-","-","-","-"]
["BELLARIA 03","-1 +0,5 mm","PCB","PCB 169","ng/g","<LOQ","-","-","-","-"]
["BELLARIA 03","-1 +0,5 mm","PCB","PCB 189","ng/g","<LOQ","-","-","-","-"]
["BELLARIA 03","-1 +0,5 mm","PCB","PCB 209","ng/g","<LOQ","-","-","-","-"]
["BELLARIA 03","-1 +0,5 mm","PCB","Sum PCB","ng/g",0.36827419145788609,60,5000,{"$f":"IF(F1393<G1393,\"Yes\",\"No\")","v":"Yes"},{"$f":"IF(F1393<H1393,\"Yes\",\"No\")","v":"Yes"}]
["BELLARIA 03","-1 +0,5 mm","PCB","CB 110","ng/g",5.7207641391516274E-2,"-","-","-","-"]
["BELLARIA 03","-0,5 +0,063 mm","PCB","PCB 28","ng/g","<LOQ","-","-","-","-"]
["BELLARIA 03","-0,5 +0,063 mm","PCB","PCB 52","ng/g",0.10968647235879475,"-","-","-","-"]
["BELLARIA 03","-0,5 +0,063 mm","PCB","PCB 101","ng/g",0.11996957914243174,"-","-","-","-"]
["BELLARIA 03","-0,5 +0,063 mm","PCB","PCB 81","ng/g","<LOQ","-","-","-","-"]
["BELLARIA 03","-0,5 +0,063 mm","PCB","PCB 77","ng/g","<LOQ","-","-","-","-"]
["BELLARIA 03","-0,5 +0,063 mm","PCB","PCB123","ng/g","<LOQ","-","-","-","-"]
["BELLARIA 03","-0,5 +0,063 mm","PCB","PCB 118","ng/g",6.5126342963034392E-2,"-","-","-","-"]
["BELLARIA 03","-0,5 +0,063 mm","PCB","PCB 114","ng/g","<LOQ","-","-","-","-"]
["BELLARIA 03","-0,5 +0,063 mm","PCB","PCB 153","ng/g",0.20566213567274014,"-","-","-","-"]
["BELLARIA 03","-0,5 +0,063 mm","PCB","PCB 105","ng/g",5.827093844060971E-2,"-","-","-","-"]
["BELLARIA 03","-0,5 +0,063 mm","PCB","PCB 138","ng/g",0.13710809044849345,"-","-","-","-"]
["BELLARIA 03","-0,5 +0,063 mm","PCB","PCB 126","ng/g","<LOQ","-","-","-","-"]
["BELLARIA 03","-0,5 +0,063 mm","PCB","PCB 128","ng/g","<LOQ","-","-","-","-"]
["BELLARIA 03","-0,5 +0,063 mm","PCB","PCB167","ng/g","<LOQ","-","-","-","-"]
["BELLARIA 03","-0,5 +0,063 mm","PCB","PCB 156","ng/g","<LOQ","-","-","-","-"]
["BELLARIA 03","-0,5 +0,063 mm","PCB","PCB 157","ng/g","<LOQ","-","-","-","-"]
["BELLARIA 03","-0,5 +0,063 mm","PCB","PCB 180","ng/g",5.1415533918185034E-2,"-","-","-","-"]
["BELLARIA 03","-0,5 +0,063 mm","PCB","PCB 170","ng/g","<LOQ","-","-","-","-"]
["BELLARIA 03","-0,5 +0,063 mm","PCB","PCB 169","ng/g","<LOQ","-","-","-","-"]
["BELLARIA 03","-0,5 +0,063 mm","PCB","PCB 189","ng/g","<LOQ","-","-","-","-"]
["BELLARIA 03","-0,5 +0,063 mm","PCB","PCB 209","ng/g","<LOQ","-","-","-","-"]
["BELLARIA 03","-0,5 +0,063 mm","PCB","Sum PCB","ng/g",0.74723909294428914,60,5000,{"$f":"IF(F1416<G1416,\"Yes\",\"No\")","v":"Yes"},{"$f":"IF(F1416<H1416,\"Yes\",\"No\")","v":"Yes"}]
["BELLARIA 03","-0,5 +0,063 mm","PCB","CB 110","ng/g",0.11996957914243177,"-","-","-","-"]
["BELLARIA 03","-0,063 mm","PCB","PCB 28","ng/g",0.51202354131224426,"-","-","-","-"]
["BELLARIA 03","-0,063 mm","PCB","PCB 52","ng/g",1.3124281576164423,"-","-","-","-"]
["BELLARIA 03","-0,063 mm","PCB","PCB 101","ng/g",2.5660030346222813,"-","-","-","-"]
["BELLARIA 03","-0,063 mm","PCB","PCB 81","ng/g","<LOQ","-","-","-","-"]
["BELLARIA 03","-0,063 mm","PCB","PCB 77","ng/g","<LOQ","-","-","-","-"]
["BELLARIA 03","-0,063 mm","PCB","PCB123","ng/g",0.13241988137385632,"-","-","-","-"]
["BELLARIA 03","-0,063 mm","PCB","PCB 118","ng/g",1.4301347188376483,"-","-","-","-"]
["BELLARIA 03","-0,063 mm","PCB","PCB 114","ng/g",7.650926479378363E-2,"-","-","-","-"]
["BELLARIA 03","-0,063 mm","PCB","PCB 153","ng/g",8.1011540760494753,"-","-","-","-"]
["BELLARIA 03","-0,063 mm","PCB","PCB 105","ng/g",2.1569727343785927,"-","-","-","-"]
["BELLARIA 03","-0,063 mm","PCB","PCB 138","ng/g",4.7465170812451163,"-","-","-","-"]
["BELLARIA 03","-0,063 mm","PCB","PCB 126","ng/g","<LOQ","-","-","-","-"]
["BELLARIA 03","-0,063 mm","PCB","PCB 128","ng/g",0.7680353119683665,"-","-","-","-"]
["BELLARIA 03","-0,063 mm","PCB","PCB167","ng/g",0.12064922525173573,"-","-","-","-"]
["BELLARIA 03","-0,063 mm","PCB","PCB 156","ng/g",0.2883810749919537,"-","-","-","-"]
["BELLARIA 03","-0,063 mm","PCB","PCB 157","ng/g","<LOQ","-","-","-","-"]
["BELLARIA 03","-0,063 mm","PCB","PCB 180","ng/g",2.1687433905007132,"-","-","-","-"]
["BELLARIA 03","-0,063 mm","PCB","PCB 170","ng/g",0.71801002344935416,"-","-","-","-"]
["BELLARIA 03","-0,063 mm","PCB","PCB 169","ng/g","<LOQ","-","-","-","-"]
["BELLARIA 03","-0,063 mm","PCB","PCB 189","ng/g","<LOQ","-","-","-","-"]
["BELLARIA 03","-0,063 mm","PCB","PCB 209","ng/g","<LOQ","-","-","-","-"]
["BELLARIA 03","-0,063 mm","PCB","Sum PCB","ng/g",25.09798151639156,60,5000,{"$f":"IF(F1439<G1439,\"Yes\",\"No\")","v":"Yes"},{"$f":"IF(F1439<H1439,\"Yes\",\"No\")","v":"Yes"}]
["BELLARIA 03","-0,063 mm","PCB","CB 110","ng/g",2.4306404892178954,"-","-","-","-"]
["BELLARIA 03","Dredged sediment","Hydrocarbons (C > 12 mg/kg)",null,"mg/kg",7,50,750,{"$f":"IF(F1441<G1441,\"Yes\",\"No\")","v":"Yes"},{"$f":"IF(F1441<H1441,\"Yes\",\"No\")","v":"Yes"}]
["BELLARIA 03","-1 +0,5 mm","Hydrocarbons (C > 12 mg/kg)",null,"mg/kg",10,50,750,{"$f":"IF(F1442<G1442,\"Yes\",\"No\")","v":"Yes"},{"$f":"IF(F1442<H1442,\"Yes\",\"No\")","v":"Yes"}]
["BELLARIA 03","-0,5 +0,063 mm","Hydrocarbons (C > 12 mg/kg)",null,"mg/kg",17,50,750,{"$f":"IF(F1443<G1443,\"Yes\",\"No\")","v":"Yes"},{"$f":"IF(F1443<H1443,\"Yes\",\"No\")","v":"Yes"}]
["BELLARIA 03","-0,063 mm","Hydrocarbons (C > 12 mg/kg)",null,"mg/kg",32,50,750,{"$f":"IF(F1444<G1444,\"Yes\",\"No\")","v":"Yes"},{"$f":"IF(F1444<H1444,\"Yes\",\"No\")","v":"Yes"}]
["BELLARIA 03","Dredged sediment","Tributyltin ",null,"μg/kg",1.3,null,null,null,null,"*D. Lgs. 152/06: environmental quality standards in sediments expressed as the annual average   (SQA-MA) = 5 µg/kg SS * "]
["BELLARIA 03","-1 +0,5 mm","Tributyltin ",null,"μg/kg",0.6]
["BELLARIA 03","-0,5 +0,063 mm","Tributyltin ",null,"μg/kg",0.8]
["BELLARIA 03","-0,063 mm","Tributyltin ",null,"μg/kg",0.9]
["BELLARIA 03","Dredged sediment","Pesticides","HCB","ng/g",null,50,5000]
["BELLARIA 03","Dredged sediment","Pesticides","a-HCH","ng/g",null,"-","-","-","-"]
["BELLARIA 03","Dredged sediment","Pesticides","b-HCH","ng/g",null,"-","-","-","-"]
["BELLARIA 03","Dredged sediment","Pesticides","g-HCH","ng/g",null,"-","-","-","-"]
["BELLARIA 03","Dredged sediment","Pesticides","Aldrin","ng/g",null,10,100]
["BELLARIA 03","Dredged sediment","Pesticides","o,p` DDE","ng/g",null,10,100,{"$f":"IF(F1454<G1454,\"Yes\",\"No\")","v":"Yes"},{"$f":"IF(F1454<H1454,\"Yes\",\"No\")","v":"Yes"}]
["BELLARIA 03","Dredged sediment","Pesticides","g-chlordane","ng/g",null,null,null,"-","-"]
["BELLARIA 03","Dredged sediment","Pesticides","a-chlordane","ng/g",null,null,null,"-","-"]
["BELLARIA 03","Dredged sediment","Pesticides","p,p`DDE","ng/g",null,10,100,{"$f":"IF(F1457<G1457,\"Yes\",\"No\")","v":"Yes"},{"$f":"IF(F1457<H1457,\"Yes\",\"No\")","v":"Yes"}]
["BELLARIA 03","Dredged sediment","Pesticides","Dieldrin","ng/g",null,10,100]
["BELLARIA 03","Dredged sediment","Pesticides","o,p`DDD","ng/g",null,10,100,{"$f":"IF(F1459<G1459,\"Yes\",\"No\")","v":"Yes"},{"$f":"IF(F1459<H1459,\"Yes\",\"No\")","v":"Yes"}]
["BELLARIA 03","Dredged sediment","Pesticides","Endrin","ng/g",null,10,2000]
["BELLARIA 03","Dredged sediment","Pesticides","o,p`DDT","ng/g",null,10,100,{"$f":"IF(F1461<G1461,\"Yes\",\"No\")","v":"Yes"},{"$f":"IF(F1461<H1461,\"Yes\",\"No\")","v":"Yes"}]
["BELLARIA 03","Dredged sediment","Pesticides","p,p`DDD","ng/g",null,10,100,"Yes","Yes"]
["BELLARIA 03","Dredged sediment","Pesticides","p,p`DDT","ng/g",null,10,100,"Yes","Yes"]
["BELLARIA 03","+0,5 mm","Pesticides","HCB","ng/g",null,50,5000,{"$f":"IF(F1464<G1464,\"Yes\",\"No\")","v":"Yes"},{"$f":"IF(F1464<H1464,\"Yes\",\"No\")","v":"Yes"}]
["BELLARIA 03","+0,5 mm","Pesticides","a-HCH","ng/g",null,"-","-","-","-"]
["BELLARIA 03","+0,5 mm","Pesticides","b-HCH","ng/g",null,"-","-","-","-"]
["BELLARIA 03","+0,5 mm","Pesticides","g-HCH","ng/g",null,"-","-","-","-"]
["BELLARIA 03","+0,5 mm","Pesticides","Aldrin","ng/g",null,10,100]
["BELLARIA 03","+0,5 mm","Pesticides","o,p` DDE","ng/g",null,10,100,{"$f":"IF(F1469<G1469,\"Yes\",\"No\")","v":"Yes"},{"$f":"IF(F1469<H1469,\"Yes\",\"No\")","v":"Yes"}]
["BELLARIA 03","+0,5 mm","Pesticides","g-chlordane","ng/g",null,null,null,"-","-"]
["BELLARIA 03","+0,5 mm","Pesticides","a-chlordane","ng/g",null,null,null,"-","-"]
["BELLARIA 03","+0,5 mm","Pesticides","p,p`DDE","ng/g",null,10,100,{"$f":"IF(F1472<G1472,\"Yes\",\"No\")","v":"Yes"},{"$f":"IF(F1472<H1472,\"Yes\",\"No\")","v":"Yes"}]
["BELLARIA 03","+0,5 mm","Pesticides","Dieldrin","ng/g",null,10,100]
["BELLARIA 03","+0,5 mm","Pesticides","o,p`DDD","ng/g",null,10,100,{"$f":"IF(F1474<G1474,\"Yes\",\"No\")","v":"Yes"},{"$f":"IF(F1474<H1474,\"Yes\",\"No\")","v":"Yes"}]
["BELLARIA 03","+0,5 mm","Pesticides","Endrin","ng/g",null,10,2000]
["BELLARIA 03","+0,5 mm","Pesticides","o,p`DDT","ng/g",null,10,100,{"$f":"IF(F1476<G1476,\"Yes\",\"No\")","v":"Yes"},{"$f":"IF(F1476<H1476,\"Yes\",\"No\")","v":"Yes"}]
["BELLARIA 03","+0,5 mm","Pesticides","p,p`DDD","ng/g",null,10,100,"Yes","Yes"]
["BELLARIA 03","+0,5 mm","Pesticides","p,p`DDT","ng/g",null,10,100,"Yes","Yes"]
["BELLARIA 03","-0,5 +0,063 mm","Pesticides","HCB","ng/g",null,50,5000,{"$f":"IF(F1479<G1479,\"Yes\",\"No\")","v":"Yes"},{"$f":"IF(F1479<H1479,\"Yes\",\"No\")","v":"Yes"}]
["BELLARIA 03","-0,5 +0,063 mm","Pesticides","a-HCH","ng/g",null,"-","-","-","-"]
["BELLARIA 03","-0,5 +0,063 mm","Pesticides","b-HCH","ng/g",null,"-","-","-","-"]
["BELLARIA 03","-0,5 +0,063 mm","Pesticides","g-HCH","ng/g",null,"-","-","-","-"]
["BELLARIA 03","-0,5 +0,063 mm","Pesticides","Aldrin","ng/g",null,10,100]
["BELLARIA 03","-0,5 +0,063 mm","Pesticides","o,p` DDE","ng/g",null,10,100]
["BELLARIA 03","-0,5 +0,063 mm","Pesticides","g-chlordane","ng/g",null,null,null,"-","-"]
["BELLARIA 03","-0,5 +0,063 mm","Pesticides","a-chlordane","ng/g",null,null,null,"-","-"]
["BELLARIA 03","-0,5 +0,063 mm","Pesticides","p,p`DDE","ng/g",null,10,100,{"$f":"IF(F1487<G1487,\"Yes\",\"No\")","v":"Yes"},{"$f":"IF(F1487<H1487,\"Yes\",\"No\")","v":"Yes"}]
["BELLARIA 03","-0,5 +0,063 mm","Pesticides","Dieldrin","ng/g",null,10,100]
["BELLARIA 03","-0,5 +0,063 mm","Pesticides","o,p`DDD","ng/g",null,10,100,{"$f":"IF(F1489<G1489,\"Yes\",\"No\")","v":"Yes"},{"$f":"IF(F1489<H1489,\"Yes\",\"No\")","v":"Yes"}]
["BELLARIA 03","-0,5 +0,063 mm","Pesticides","Endrin","ng/g",null,10,2000]
["BELLARIA 03","-0,5 +0,063 mm","Pesticides","o,p`DDT","ng/g",null,10,100]
["BELLARIA 03","-0,5 +0,063 mm","Pesticides","p,p`DDD","ng/g",null,10,100,{"$f":"IF(F1492<G1492,\"Yes\",\"No\")","v":"Yes"},{"$f":"IF(F1492<H1492,\"Yes\",\"No\")","v":"Yes"}]
["BELLARIA 03","-0,5 +0,063 mm","Pesticides","p,p`DDT","ng/g",null,10,100,"Yes","Yes"]
["BELLARIA 03","-0,063 mm","Pesticides","HCB","ng/g",null,50,5000,{"$f":"IF(F1494<G1494,\"Yes\",\"No\")","v":"Yes"},{"$f":"IF(F1494<H1494,\"Yes\",\"No\")","v":"Yes"}]
["BELLARIA 03","-0,063 mm","Pesticides","a-HCH","ng/g",null,"-","-","-","-"]
["BELLARIA 03","-0,063 mm","Pesticides","b-HCH","ng/g",null,"-","-","-","-"]
["BELLARIA 03","-0,063 mm","Pesticides","g-HCH","ng/g",null,"-","-","-","-"]
["BELLARIA 03","-0,063 mm","Pesticides","Aldrin","ng/g",null,10,100]
["BELLARIA 03","-0,063 mm","Pesticides","o,p` DDE","ng/g",null,10,100,{"$f":"IF(F1499<G1499,\"Yes\",\"No\")","v":"Yes"},{"$f":"IF(F1499<H1499,\"Yes\",\"No\")","v":"Yes"}]
["BELLARIA 03","-0,063 mm","Pesticides","g-chlordane","ng/g",null,null,null,"-","-"]
["BELLARIA 03","-0,063 mm","Pesticides","a-chlordane","ng/g",null,null,null,"-","-"]
["BELLARIA 03","-0,063 mm","Pesticides","p,p`DDE","ng/g",null,10,100,{"$f":"IF(F1502<G1502,\"Yes\",\"No\")","v":"Yes"},{"$f":"IF(F1502<H1502,\"Yes\",\"No\")","v":"Yes"}]
["BELLARIA 03","-0,063 mm","Pesticides","Dieldrin","ng/g",null,10,100]
["BELLARIA 03","-0,063 mm","Pesticides","o,p`DDD","ng/g",null,10,100,{"$f":"IF(F1504<G1504,\"Yes\",\"No\")","v":"Yes"},{"$f":"IF(F1504<H1504,\"Yes\",\"No\")","v":"Yes"}]
["BELLARIA 03","-0,063 mm","Pesticides","Endrin","ng/g",null,10,2000]
["BELLARIA 03","-0,063 mm","Pesticides","o,p`DDT","ng/g",null,10,100,{"$f":"IF(F1506<G1506,\"Yes\",\"No\")","v":"Yes"},{"$f":"IF(F1506<H1506,\"Yes\",\"No\")","v":"Yes"}]
["BELLARIA 03","-0,063 mm","Pesticides","p,p`DDD","ng/g",null,10,100,"Yes","Yes"]
["BELLARIA 03","-0,063 mm","Pesticides","p,p`DDT","ng/g",null,10,100,"Yes","Yes"]
["CERVIA","+0,5 mm","Granulometric Analysis",null,"%",4.8]
["CERVIA","-0,5 +0,063 mm","Granulometric Analysis",null,"%",90.86]
["CERVIA","-0,063 mm","Granulometric Analysis",null,"%",4.34]
["CERVIA","Dredged sediment","Shepard classification",null,null,"Sand"]
["CERVIA","Dredged sediment","Nota classification",null,null,"Sand"]
["CERVIA","Dredged sediment","VS (%TS)",null,"%",2.86]
["CERVIA","-0,5 +0,063 mm","VS (%TS)",null,"%",1.56]
["CERVIA","Dredged sediment","TC (%TS)",null,"%",3.16]
["CERVIA","-0,5 +0,063 mm","TC (%TS)",null,"%",3.1]
["CERVIA","Dredged sediment","IC (%TS)",null,"%",1.47]
["CERVIA","-0,5 +0,063 mm","IC (%TS)",null,"%",2.2799999999999998]
["CERVIA","Dredged sediment","TOC (%TS)",null,"%",1.69]
["CERVIA","-0,5 +0,063 mm","TOC (%TS)",null,"%",0.82]
["CERVIA","Dredged sediment","O2 consumption (840 h)",null,"(mg O2/kg TS)",13703.36]
["CERVIA","-0,5 +0,063 mm","O2 consumption (840 h)",null,"(mg O2/kg TS)",93.36]
["CERVIA","Dredged sediment","METALS","Zn ","mg/kg",62.254999999999995,150,1500,{"$f":"IF(F1524<G1524,\"Yes\",\"No\")","v":"Yes"},{"$f":"IF(F1524<H1524,\"Yes\",\"No\")","v":"Yes"}]
["CERVIA","Dredged sediment","METALS","Ni","mg/kg",39.909999999999997,120,500,{"$f":"IF(F1525<G1525,\"Yes\",\"No\")","v":"Yes"},{"$f":"IF(F1525<H1525,\"Yes\",\"No\")","v":"Yes"}]
["CERVIA","Dredged sediment","METALS","Cr","mg/kg",31.93,150,800,"Yes","Yes"]
["CERVIA","Dredged sediment","METALS","Pb","mg/kg",25.82,100,1000,"Yes","Yes"]
["CERVIA","Dredged sediment","METALS","As","mg/kg",8.92,20,50,"Yes","Yes"]
["CERVIA","Dredged sediment","METALS","Cd","mg/kg",0.3,2,15,"Yes","Yes"]
["CERVIA","Dredged sediment","METALS","Cu","mg/kg",13.97,120,600,"Yes","Yes"]
["CERVIA","Dredged sediment","METALS","V","mg/kg",53.25,90,250,"Yes","Yes"]
["CERVIA","Dredged sediment","METALS","Hg","mg/kg",1.15E-2,1,5,{"$f":"IF(F1532<G1532,\"Yes\",\"No\")","v":"Yes"},{"$f":"IF(F1532<H1532,\"Yes\",\"No\")","v":"Yes"}]
["CERVIA","-0,5 +0,063 mm","METALS","Zn ","mg/kg",61.9,150,1500,"Yes","Yes"]
["CERVIA","-0,5 +0,063 mm","METALS","Ni","mg/kg",49.92,120,500,"Yes","Yes"]
["CERVIA","-0,5 +0,063 mm","METALS","Cr","mg/kg",67.89,150,800,"Yes","Yes"]
["CERVIA","-0,5 +0,063 mm","METALS","Pb","mg/kg",24.119999999999997,100,1000,"Yes","Yes"]
["CERVIA","-0,5 +0,063 mm","METALS","As","mg/kg",6.71,20,50,"Yes","Yes"]
["CERVIA","-0,5 +0,063 mm","METALS","Cd","mg/kg",0.30000000000000004,2,15,"Yes","Yes"]
["CERVIA","-0,5 +0,063 mm","METALS","Cu","mg/kg",15.97,120,600,{"$f":"IF(F1539<G1539,\"Yes\",\"No\")","v":"Yes"},{"$f":"IF(F1539<H1539,\"Yes\",\"No\")","v":"Yes"}]
["CERVIA","-0,5 +0,063 mm","METALS","V","mg/kg",63.15,90,250,"Yes","Yes"]
["CERVIA","-0,5 +0,063 mm","METALS","Hg","mg/kg",1.9099999999999999E-2,1,5,{"$f":"IF(F1541<G1541,\"Yes\",\"No\")","v":"Yes"},{"$f":"IF(F1541<H1541,\"Yes\",\"No\")","v":"Yes"}]
["CERVIA","-0,063 mm","METALS","Zn ","mg/kg",131.79,150,1500,{"$f":"IF(F1542<G1542,\"Yes\",\"No\")","v":"Yes"},"Yes"]
["CERVIA","-0,063 mm","METALS","Ni","mg/kg",59.9,120,500,{"$f":"IF(F1543<G1543,\"Yes\",\"No\")","v":"Yes"},"Yes"]
["CERVIA","-0,063 mm","METALS","Cr","mg/kg",55.91,150,800,"Yes","Yes"]
["CERVIA","-0,063 mm","METALS","Pb","mg/kg",27.074999999999999,100,1000,"Yes","Yes"]
["CERVIA","-0,063 mm","METALS","As","mg/kg",6.87,20,50,{"$f":"IF(F1546<G1546,\"Yes\",\"No\")","v":"Yes"},{"$f":"IF(F1546<H1546,\"Yes\",\"No\")","v":"Yes"}]
["CERVIA","-0,063 mm","METALS","Cd","mg/kg",0.12,2,15,"Yes","Yes"]
["CERVIA","-0,063 mm","METALS","Cu","mg/kg",31.95,120,600,"Yes","Yes"]
["CERVIA","-0,063 mm","METALS","V","mg/kg",119.81,90,250,{"$f":"IF(F1549<G1549,\"Yes\",\"No\")","v":"No"},{"$f":"IF(F1549<H1549,\"Yes\",\"No\")","v":"Yes"}]
["CERVIA","-0,063 mm","METALS","Hg","mg/kg",5.7700000000000001E-2,1,5,"Yes","Yes"]
["CERVIA","Dredged sediment","PAH","naphthalene ","ng/g",6.5894360873790676,"-","-","-","-"]
["CERVIA","Dredged sediment","PAH","acenaphthene","ng/g","<LOQ","-","-","-","-"]
["CERVIA","Dredged sediment","PAH","fluorene","ng/g",1.0391810184332944,"-","-","-","-"]
["CERVIA","Dredged sediment","PAH","phenanthrene","ng/g",15.151702956963485,"-","-","-","-"]
["CERVIA","Dredged sediment","PAH","anthracene","ng/g",2.4817632242436649,"-","-","-","-"]
["CERVIA","Dredged sediment","PAH","fluoranthene","ng/g",25.537096509252176,"-","-","-","-"]
["CERVIA","Dredged sediment","PAH","pyrene","ng/g",24.715364116428589,5000,50000,{"$f":"IF(F1557<G1557,\"Yes\",\"No\")","v":"Yes"},{"$f":"IF(F1557<H1557,\"Yes\",\"No\")","v":"Yes"}]
["CERVIA","Dredged sediment","PAH","benzo(a)anthracene","ng/g",13.34964165218774,500,10000,{"$f":"IF(F1558<G1558,\"Yes\",\"No\")","v":"Yes"},{"$f":"IF(F1558<H1558,\"Yes\",\"No\")","v":"Yes"}]
["CERVIA","Dredged sediment","PAH","chrysene","ng/g",18.038419162596785,5000,50000,"Yes","Yes"]
["CERVIA","Dredged sediment","PAH","benzo(b)fluoranthene","ng/g",17.204360085864217,500,10000,"Yes","Yes"]
["CERVIA","Dredged sediment","PAH","benzo(k)fluoranthene","ng/g",7.2552671755485223,500,10000,"Yes","Yes"]
["CERVIA","Dredged sediment","PAH","benzo(a)pyrene","ng/g",16.604114359953893,100,10000,"Yes","Yes"]
["CERVIA","Dredged sediment","PAH","dibenzo(a,h)anthracene","ng/g",1.4109397751056543,100,10000,"Yes","Yes"]
["CERVIA","Dredged sediment","PAH","benzo(g,h,i)perylene","ng/g",13.077462135295775,100,10000,"Yes","Yes"]
["CERVIA","Dredged sediment","PAH","indeno(1,2,3,c,d)pyrene","ng/g",9.0455236746853966,100,5000,"Yes","Yes"]
["CERVIA","Dredged sediment","PAH","Sum PAH","ng/g",171.50027193393822,10000,100000,"Yes","Yes"]
["CERVIA","-0,5 +0,063 mm","PAH","naphthalene ","ng/g",5.748323746649227,"-","-","-","-"]
["CERVIA","-0,5 +0,063 mm","PAH","acenaphthene","ng/g","<LOQ","-","-","-","-"]
["CERVIA","-0,5 +0,063 mm","PAH","fluorene","ng/g",1.8944208760355856,"-","-","-","-"]
["CERVIA","-0,5 +0,063 mm","PAH","phenanthrene","ng/g",9.1773525792110284,"-","-","-","-"]
["CERVIA","-0,5 +0,063 mm","PAH","anthracene","ng/g",1.982980267022258,"-","-","-","-"]
["CERVIA","-0,5 +0,063 mm","PAH","fluoranthene","ng/g",21.961436164487782,"-","-","-","-"]
["CERVIA","-0,5 +0,063 mm","PAH","pyrene","ng/g",19.377651854641421,5000,50000,{"$f":"IF(F1573<G1573,\"Yes\",\"No\")","v":"Yes"},{"$f":"IF(F1573<H1573,\"Yes\",\"No\")","v":"Yes"}]
["CERVIA","-0,5 +0,063 mm","PAH","benzo(a)anthracene","ng/g",9.3473104700833822,500,10000,{"$f":"IF(F1574<G1574,\"Yes\",\"No\")","v":"Yes"},{"$f":"IF(F1574<H1574,\"Yes\",\"No\")","v":"Yes"}]
["CERVIA","-0,5 +0,063 mm","PAH","chrysene","ng/g",11.307971023562484,5000,50000,"Yes","Yes"]
["CERVIA","-0,5 +0,063 mm","PAH","benzo(b)fluoranthene","ng/g",12.194600907263281,500,10000,"Yes","Yes"]
["CERVIA","-0,5 +0,063 mm","PAH","benzo(k)fluoranthene","ng/g",4.7240585641065058,500,10000,"Yes","Yes"]
["CERVIA","-0,5 +0,063 mm","PAH","benzo(a)pyrene","ng/g",10.587571527670445,100,10000,"Yes","Yes"]
["CERVIA","-0,5 +0,063 mm","PAH","dibenzo(a,h)anthracene","ng/g",1.0020703260938395,100,10000,{"$f":"IF(F1579<G1579,\"Yes\",\"No\")","v":"Yes"},{"$f":"IF(F1579<H1579,\"Yes\",\"No\")","v":"Yes"}]
["CERVIA","-0,5 +0,063 mm","PAH","benzo(g,h,i)perylene","ng/g",8.8291056844372982,100,10000,{"$f":"IF(F1580<G1580,\"Yes\",\"No\")","v":"Yes"},{"$f":"IF(F1580<H1580,\"Yes\",\"No\")","v":"Yes"}]
["CERVIA","-0,5 +0,063 mm","PAH","indeno(1,2,3,c,d)pyrene","ng/g",6.3432172678994929,100,5000,"Yes","Yes"]
["CERVIA","-0,5 +0,063 mm","PAH","Sum PAH","ng/g",124.47807125916403,10000,100000,"Yes","Yes"]
["CERVIA","-0,063 mm","PAH","naphthalene ","ng/g",7.342229047534838,"-","-","-","-"]
["CERVIA","-0,063 mm","PAH","acenaphthene","ng/g",0.53248151466058558,"-","-","-","-"]
["CERVIA","-0,063 mm","PAH","fluorene","ng/g",3.0459393440577918,"-","-","-","-"]
["CERVIA","-0,063 mm","PAH","phenanthrene","ng/g",40.819399104535989,"-","-","-","-"]
["CERVIA","-0,063 mm","PAH","anthracene","ng/g",2.2613143171379724,"-","-","-","-"]
["CERVIA","-0,063 mm","PAH","fluoranthene","ng/g",25.598577445657817,"-","-","-","-"]
["CERVIA","-0,063 mm","PAH","pyrene","ng/g",23.683330594791986,5000,50000,{"$f":"IF(F1589<G1589,\"Yes\",\"No\")","v":"Yes"},{"$f":"IF(F1589<H1589,\"Yes\",\"No\")","v":"Yes"}]
["CERVIA","-0,063 mm","PAH","benzo(a)anthracene","ng/g",8.0650577056171215,500,10000,{"$f":"IF(F1590<G1590,\"Yes\",\"No\")","v":"Yes"},{"$f":"IF(F1590<H1590,\"Yes\",\"No\")","v":"Yes"}]
["CERVIA","-0,063 mm","PAH","chrysene","ng/g",7.7448332505115189,5000,50000,"Yes","Yes"]
["CERVIA","-0,063 mm","PAH","benzo(b)fluoranthene","ng/g",18.732068547826991,500,10000,"Yes","Yes"]
["CERVIA","-0,063 mm","PAH","benzo(k)fluoranthene","ng/g",5.7631391302561141,500,10000,"Yes","Yes"]
["CERVIA","-0,063 mm","PAH","benzo(a)pyrene","ng/g",10.574807073680402,100,10000,"Yes","Yes"]
["CERVIA","-0,063 mm","PAH","dibenzo(a,h)anthracene","ng/g",0.77049409025036164,100,10000,"Yes","Yes"]
["CERVIA","-0,063 mm","PAH","benzo(g,h,i)perylene","ng/g",10.112124912775597,100,10000,"Yes","Yes"]
["CERVIA","-0,063 mm","PAH","indeno(1,2,3,c,d)pyrene","ng/g",6.4624504836389747,100,5000,"Yes","Yes"]
["CERVIA","-0,063 mm","PAH","Sum PAH","ng/g",171.50824656293406,10000,100000,"Yes","Yes"]
["CERVIA","Dredged sediment","PCB","PCB 28","ng/g","<LOQ","-","-","-","-"]
["CERVIA","Dredged sediment","PCB","PCB 52","ng/g",0.10431673589568326,"-","-","-","-"]
["CERVIA","Dredged sediment","PCB","PCB 101","ng/g",0.2456490877543509,"-","-","-","-"]
["CERVIA","Dredged sediment","PCB","PCB 81","ng/g","<LOQ","-","-","-","-"]
["CERVIA","Dredged sediment","PCB","PCB 77","ng/g","<LOQ","-","-","-","-"]
["CERVIA","Dredged sediment","PCB","PCB123","ng/g","<LOQ","-","-","-","-"]
["CERVIA","Dredged sediment","PCB","PCB 118","ng/g",0.2052684157947316,"-","-","-","-"]
["CERVIA","Dredged sediment","PCB","PCB 114","ng/g","<LOQ","-","-","-","-"]
["CERVIA","Dredged sediment","PCB","PCB 153","ng/g",0.28939481571060516,"-","-","-","-"]
["CERVIA","Dredged sediment","PCB","PCB 105","ng/g",0.10431673589568326,"-","-","-","-"]
["CERVIA","Dredged sediment","PCB","PCB 138","ng/g",0.22209369577790627,"-","-","-","-"]
["CERVIA","Dredged sediment","PCB","PCB 126","ng/g","<LOQ","-","-","-","-"]
["CERVIA","Dredged sediment","PCB","PCB 128","ng/g",5.3840895946159102E-2,"-","-","-","-"]
["CERVIA","Dredged sediment","PCB","PCB167","ng/g","<LOQ","-","-","-","-"]
["CERVIA","Dredged sediment","PCB","PCB 156","ng/g","<LOQ","-","-","-","-"]
["CERVIA","Dredged sediment","PCB","PCB 157","ng/g","<LOQ","-","-","-","-"]
["CERVIA","Dredged sediment","PCB","PCB 180","ng/g",6.0571007939428996E-2,"-","-","-","-"]
["CERVIA","Dredged sediment","PCB","PCB 170","ng/g","<LOQ","-","-","-","-"]
["CERVIA","Dredged sediment","PCB","PCB 169","ng/g","<LOQ","-","-","-","-"]
["CERVIA","Dredged sediment","PCB","PCB 189","ng/g","<LOQ","-","-","-","-"]
["CERVIA","Dredged sediment","PCB","PCB 209","ng/g","<LOQ","-","-","-","-"]
["CERVIA","Dredged sediment","PCB","Sum PCB","ng/g",1.2854513907145488,60,5000,{"$f":"IF(F1620<G1620,\"Yes\",\"No\")","v":"Yes"},{"$f":"IF(F1620<H1620,\"Yes\",\"No\")","v":"Yes"}]
["CERVIA","Dredged sediment","PCB","CB 110","ng/g",0.23891897576108101,"-","-","-","-"]
["CERVIA","-0,5 +0,063 mm","PCB","PCB 28","ng/g","<LOQ","-","-","-","-"]
["CERVIA","-0,5 +0,063 mm","PCB","PCB 52","ng/g",0.16750157872461205,"-","-","-","-"]
["CERVIA","-0,5 +0,063 mm","PCB","PCB 101","ng/g",0.16458381354980739,"-","-","-","-"]
["CERVIA","-0,5 +0,063 mm","PCB","PCB 81","ng/g","<LOQ","-","-","-","-"]
["CERVIA","-0,5 +0,063 mm","PCB","PCB 77","ng/g","<LOQ","-","-","-","-"]
["CERVIA","-0,5 +0,063 mm","PCB","PCB123","ng/g","<LOQ","-","-","-","-"]
["CERVIA","-0,5 +0,063 mm","PCB","PCB 118","ng/g",9.9384849812605175E-2,"-","-","-","-"]
["CERVIA","-0,5 +0,063 mm","PCB","PCB 114","ng/g","<LOQ","-","-","-","-"]
["CERVIA","-0,5 +0,063 mm","PCB","PCB 153","ng/g",0.27200695241258821,"-","-","-","-"]
["CERVIA","-0,5 +0,063 mm","PCB","PCB 105","ng/g",7.3322267200310917E-2,"-","-","-","-"]
["CERVIA","-0,5 +0,063 mm","PCB","PCB 138","ng/g",0.20024983581584593,"-","-","-","-"]
["CERVIA","-0,5 +0,063 mm","PCB","PCB 126","ng/g","<LOQ","-","-","-","-"]
["CERVIA","-0,5 +0,063 mm","PCB","PCB 128","ng/g",5.0517507414553409E-2,"-","-","-","-"]
["CERVIA","-0,5 +0,063 mm","PCB","PCB167","ng/g","<LOQ","-","-","-","-"]
["CERVIA","-0,5 +0,063 mm","PCB","PCB 156","ng/g","<LOQ","-","-","-","-"]
["CERVIA","-0,5 +0,063 mm","PCB","PCB 157","ng/g","<LOQ","-","-","-","-"]
["CERVIA","-0,5 +0,063 mm","PCB","PCB 180","ng/g",0.13670103709514542,"-","-","-","-"]
["CERVIA","-0,5 +0,063 mm","PCB","PCB 170","ng/g",6.0205961481230738E-2,"-","-","-","-"]
["CERVIA","-0,5 +0,063 mm","PCB","PCB 169","ng/g","<LOQ","-","-","-","-"]
["CERVIA","-0,5 +0,063 mm","PCB","PCB 189","ng/g","<LOQ","-","-","-","-"]
["CERVIA","-0,5 +0,063 mm","PCB","PCB 209","ng/g","<LOQ","-","-","-","-"]
["CERVIA","-0,5 +0,063 mm","PCB","Sum PCB","ng/g",1.2244738035066991,60,5000,{"$f":"IF(F1643<G1643,\"Yes\",\"No\")","v":"Yes"},{"$f":"IF(F1643<H1643,\"Yes\",\"No\")","v":"Yes"}]
["CERVIA","-0,5 +0,063 mm","PCB","CB 110","ng/g",0.21527134979022686,"-","-","-","-"]
["CERVIA","-0,063 mm","PCB","PCB 28","ng/g",0.4383993692095407,"-","-","-","-"]
["CERVIA","-0,063 mm","PCB","PCB 52","ng/g",1.0408042578356003,"-","-","-","-"]
["CERVIA","-0,063 mm","PCB","PCB 101","ng/g",1.3782771535580522,"-","-","-","-"]
["CERVIA","-0,063 mm","PCB","PCB 81","ng/g","<LOQ","-","-","-","-"]
["CERVIA","-0,063 mm","PCB","PCB 77","ng/g","<LOQ","-","-","-","-"]
["CERVIA","-0,063 mm","PCB","PCB123","ng/g",5.9925093632958809E-2,"-","-","-","-"]
["CERVIA","-0,063 mm","PCB","PCB 118","ng/g",0.70333136211314817,"-","-","-","-"]
["CERVIA","-0,063 mm","PCB","PCB 114","ng/g","<LOQ","-","-","-","-"]
["CERVIA","-0,063 mm","PCB","PCB 153","ng/g",4.2294500295683033,"-","-","-","-"]
["CERVIA","-0,063 mm","PCB","PCB 105","ng/g",1.075497733096787,"-","-","-","-"]
["CERVIA","-0,063 mm","PCB","PCB 138","ng/g",2.4001576976148238,"-","-","-","-"]
["CERVIA","-0,063 mm","PCB","PCB 126","ng/g","<LOQ","-","-","-","-"]
["CERVIA","-0,063 mm","PCB","PCB 128","ng/g",0.46363098758131283,"-","-","-","-"]
["CERVIA","-0,063 mm","PCB","PCB167","ng/g",5.3617189040015771E-2,"-","-","-","-"]
["CERVIA","-0,063 mm","PCB","PCB 156","ng/g",0.10408042578356003,"-","-","-","-"]
["CERVIA","-0,063 mm","PCB","PCB 157","ng/g","<LOQ","-","-","-","-"]
["CERVIA","-0,063 mm","PCB","PCB 180","ng/g",1.8450620934358366,"-","-","-","-"]
["CERVIA","-0,063 mm","PCB","PCB 170","ng/g",0.60871279321900251,"-","-","-","-"]
["CERVIA","-0,063 mm","PCB","PCB 169","ng/g","<LOQ","-","-","-","-"]
["CERVIA","-0,063 mm","PCB","PCB 189","ng/g","<LOQ","-","-","-","-"]
["CERVIA","-0,063 mm","PCB","PCB 209","ng/g","<LOQ","-","-","-","-"]
["CERVIA","-0,063 mm","PCB","Sum PCB","ng/g",14.400946185688944,60,5000,{"$f":"IF(F1666<G1666,\"Yes\",\"No\")","v":"Yes"},{"$f":"IF(F1666<H1666,\"Yes\",\"No\")","v":"Yes"}]
["CERVIA","-0,063 mm","PCB","CB 110","ng/g",1.1291149221368026,"-","-","-","-"]
["CERVIA","Dredged sediment","Hydrocarbons (C > 12 mg/kg)",null,"mg/kg",13,50,750,{"$f":"IF(F1668<G1668,\"Yes\",\"No\")","v":"Yes"},{"$f":"IF(F1668<H1668,\"Yes\",\"No\")","v":"Yes"}]
["CERVIA","-0,5 +0,063 mm","Hydrocarbons (C > 12 mg/kg)",null,"mg/kg",10,50,750,{"$f":"IF(F1669<G1669,\"Yes\",\"No\")","v":"Yes"},{"$f":"IF(F1669<H1669,\"Yes\",\"No\")","v":"Yes"}]
["CERVIA","-0,063 mm","Hydrocarbons (C > 12 mg/kg)",null,"mg/kg",64,50,750,{"$f":"IF(F1670<G1670,\"Yes\",\"No\")","v":"No"},{"$f":"IF(F1670<H1670,\"Yes\",\"No\")","v":"Yes"}]
["CERVIA","Dredged sediment","Tributyltin ",null,"μg/kg",1,null,null,null,null,"*D. Lgs. 152/06: environmental quality standards in sediments expressed as the annual average   (SQA-MA) = 5 µg/kg SS * "]
["CERVIA","-0,5 +0,063 mm","Tributyltin ",null,"μg/kg",1.3]
["CERVIA","-0,063 mm","Tributyltin ",null,"μg/kg","6,2 *"]
["CERVIA","Dredged sediment","Pesticides","HCB","ng/g",null,50,5000]
["CERVIA","Dredged sediment","Pesticides","a-HCH","ng/g",null,"-","-","-","-"]
["CERVIA","Dredged sediment","Pesticides","b-HCH","ng/g",null,"-","-","-","-"]
["CERVIA","Dredged sediment","Pesticides","g-HCH","ng/g",null,"-","-","-","-"]
["CERVIA","Dredged sediment","Pesticides","Aldrin","ng/g",null,10,100]
["CERVIA","Dredged sediment","Pesticides","o,p` DDE","ng/g",null,10,100,{"$f":"IF(F1679<G1679,\"Yes\",\"No\")","v":"Yes"},{"$f":"IF(F1679<H1679,\"Yes\",\"No\")","v":"Yes"}]
["CERVIA","Dredged sediment","Pesticides","g-chlordane","ng/g",null,null,null,"-","-"]
["CERVIA","Dredged sediment","Pesticides","a-chlordane","ng/g",null,null,null,"-","-"]
["CERVIA","Dredged sediment","Pesticides","p,p`DDE","ng/g",null,10,100,{"$f":"IF(F1682<G1682,\"Yes\",\"No\")","v":"Yes"},{"$f":"IF(F1682<H1682,\"Yes\",\"No\")","v":"Yes"}]
["CERVIA","Dredged sediment","Pesticides","Dieldrin","ng/g",null,10,100]
["CERVIA","Dredged sediment","Pesticides","o,p`DDD","ng/g",null,10,100,{"$f":"IF(F1684<G1684,\"Yes\",\"No\")","v":"Yes"},{"$f":"IF(F1684<H1684,\"Yes\",\"No\")","v":"Yes"}]
["CERVIA","Dredged sediment","Pesticides","Endrin","ng/g",null,10,2000]
["CERVIA","Dredged sediment","Pesticides","o,p`DDT","ng/g",null,10,100,{"$f":"IF(F1686<G1686,\"Yes\",\"No\")","v":"Yes"},{"$f":"IF(F1686<H1686,\"Yes\",\"No\")","v":"Yes"}]
["CERVIA","Dredged sediment","Pesticides","p,p`DDD","ng/g",null,10,100,"Yes","Yes"]
["CERVIA","Dredged sediment","Pesticides","p,p`DDT","ng/g",null,10,100,"Yes","Yes"]
["CERVIA","+0,5 mm","Pesticides","HCB","ng/g",null,50,5000,{"$f":"IF(F1689<G1689,\"Yes\",\"No\")","v":"Yes"},{"$f":"IF(F1689<H1689,\"Yes\",\"No\")","v":"Yes"}]
["CERVIA","+0,5 mm","Pesticides","a-HCH","ng/g",null,"-","-","-","-"]
["CERVIA","+0,5 mm","Pesticides","b-HCH","ng/g",null,"-","-","-","-"]
["CERVIA","+0,5 mm","Pesticides","g-HCH","ng/g",null,"-","-","-","-"]
["CERVIA","+0,5 mm","Pesticides","Aldrin","ng/g",null,10,100]
["CERVIA","+0,5 mm","Pesticides","o,p` DDE","ng/g",null,10,100,{"$f":"IF(F1694<G1694,\"Yes\",\"No\")","v":"Yes"},{"$f":"IF(F1694<H1694,\"Yes\",\"No\")","v":"Yes"}]
["CERVIA","+0,5 mm","Pesticides","g-chlordane","ng/g",null,null,null,"-","-"]
["CERVIA","+0,5 mm","Pesticides","a-chlordane","ng/g",null,null,null,"-","-"]
["CERVIA","+0,5 mm","Pesticides","p,p`DDE","ng/g",null,10,100,{"$f":"IF(F1697<G1697,\"Yes\",\"No\")","v":"Yes"},{"$f":"IF(F1697<H1697,\"Yes\",\"No\")","v":"Yes"}]
["CERVIA","+0,5 mm","Pesticides","Dieldrin","ng/g",null,10,100]
["CERVIA","+0,5 mm","Pesticides","o,p`DDD","ng/g",null,10,100,{"$f":"IF(F1699<G1699,\"Yes\",\"No\")","v":"Yes"},{"$f":"IF(F1699<H1699,\"Yes\",\"No\")","v":"Yes"}]
["CERVIA","+0,5 mm","Pesticides","Endrin","ng/g",null,10,2000]
["CERVIA","+0,5 mm","Pesticides","o,p`DDT","ng/g",null,10,100,{"$f":"IF(F1701<G1701,\"Yes\",\"No\")","v":"Yes"},{"$f":"IF(F1701<H1701,\"Yes\",\"No\")","v":"Yes"}]
["CERVIA","+0,5 mm","Pesticides","p,p`DDD","ng/g",null,10,100,"Yes","Yes"]
["CERVIA","+0,5 mm","Pesticides","p,p`DDT","ng/g",null,10,100,"Yes","Yes"]
["CERVIA","-0,5 +0,063 mm","Pesticides","HCB","ng/g",null,50,5000,{"$f":"IF(F1704<G1704,\"Yes\",\"No\")","v":"Yes"},{"$f":"IF(F1704<H1704,\"Yes\",\"No\")","v":"Yes"}]
["CERVIA","-0,5 +0,063 mm","Pesticides","a-HCH","ng/g",null,"-","-","-","-"]
["CERVIA","-0,5 +0,063 mm","Pesticides","b-HCH","ng/g",null,"-","-","-","-"]
["CERVIA","-0,5 +0,063 mm","Pesticides","g-HCH","ng/g",null,"-","-","-","-"]
["CERVIA","-0,5 +0,063 mm","Pesticides","Aldrin","ng/g",null,10,100]
["CERVIA","-0,5 +0,063 mm","Pesticides","o,p` DDE","ng/g",null,10,100]
["CERVIA","-0,5 +0,063 mm","Pesticides","g-chlordane","ng/g",null,null,null,"-","-"]
["CERVIA","-0,5 +0,063 mm","Pesticides","a-chlordane","ng/g",null,null,null,"-","-"]
["CERVIA","-0,5 +0,063 mm","Pesticides","p,p`DDE","ng/g",null,10,100,{"$f":"IF(F1712<G1712,\"Yes\",\"No\")","v":"Yes"},{"$f":"IF(F1712<H1712,\"Yes\",\"No\")","v":"Yes"}]
["CERVIA","-0,5 +0,063 mm","Pesticides","Dieldrin","ng/g",null,10,100]
["CERVIA","-0,5 +0,063 mm","Pesticides","o,p`DDD","ng/g",null,10,100,{"$f":"IF(F1714<G1714,\"Yes\",\"No\")","v":"Yes"},{"$f":"IF(F1714<H1714,\"Yes\",\"No\")","v":"Yes"}]
["CERVIA","-0,5 +0,063 mm","Pesticides","Endrin","ng/g",null,10,2000]
["CERVIA","-0,5 +0,063 mm","Pesticides","o,p`DDT","ng/g",null,10,100]
["CERVIA","-0,5 +0,063 mm","Pesticides","p,p`DDD","ng/g",null,10,100,{"$f":"IF(F1717<G1717,\"Yes\",\"No\")","v":"Yes"},{"$f":"IF(F1717<H1717,\"Yes\",\"No\")","v":"Yes"}]
["CERVIA","-0,5 +0,063 mm","Pesticides","p,p`DDT","ng/g",null,10,100,"Yes","Yes"]
["CERVIA","-0,063 mm","Pesticides","HCB","ng/g",null,50,5000,{"$f":"IF(F1719<G1719,\"Yes\",\"No\")","v":"Yes"},{"$f":"IF(F1719<H1719,\"Yes\",\"No\")","v":"Yes"}]
["CERVIA","-0,063 mm","Pesticides","a-HCH","ng/g",null,"-","-","-","-"]
["CERVIA","-0,063 mm","Pesticides","b-HCH","ng/g",null,"-","-","-","-"]
["CERVIA","-0,063 mm","Pesticides","g-HCH","ng/g",null,"-","-","-","-"]
["CERVIA","-0,063 mm","Pesticides","Aldrin","ng/g",null,10,100]
["CERVIA","-0,063 mm","Pesticides","o,p` DDE","ng/g",null,10,100,{"$f":"IF(F1724<G1724,\"Yes\",\"No\")","v":"Yes"},{"$f":"IF(F1724<H1724,\"Yes\",\"No\")","v":"Yes"}]
["CERVIA","-0,063 mm","Pesticides","g-chlordane","ng/g",null,null,null,"-","-"]
["CERVIA","-0,063 mm","Pesticides","a-chlordane","ng/g",null,null,null,"-","-"]
["CERVIA","-0,063 mm","Pesticides","p,p`DDE","ng/g",null,10,100,{"$f":"IF(F1727<G1727,\"Yes\",\"No\")","v":"Yes"},{"$f":"IF(F1727<H1727,\"Yes\",\"No\")","v":"Yes"}]
["CERVIA","-0,063 mm","Pesticides","Dieldrin","ng/g",null,10,100]
["CERVIA","-0,063 mm","Pesticides","o,p`DDD","ng/g",null,10,100,{"$f":"IF(F1729<G1729,\"Yes\",\"No\")","v":"Yes"},{"$f":"IF(F1729<H1729,\"Yes\",\"No\")","v":"Yes"}]
["CERVIA","-0,063 mm","Pesticides","Endrin","ng/g",null,10,2000]
["CERVIA","-0,063 mm","Pesticides","o,p`DDT","ng/g",null,10,100,{"$f":"IF(F1731<G1731,\"Yes\",\"No\")","v":"Yes"},{"$f":"IF(F1731<H1731,\"Yes\",\"No\")","v":"Yes"}]
["CERVIA","-0,063 mm","Pesticides","p,p`DDD","ng/g",null,10,100,"Yes","Yes"]
["CERVIA","-0,063 mm","Pesticides","p,p`DDT","ng/g",null,10,100,"Yes","Yes"]

{"sheet":"Granulometric distribution","index":2,"n_rows":10,"n_cols":6,"rows_kept":10,"cut":false,"hidden":false,"merged":[[0,0,0,1]]}
["Granulometric Analysis",null,null,null,null,"CLICK BELOW TO VIEW GRAPHICS"]
[null,"Sandy fraction %","Fine fraction %","Coarse fraction %"]
["POCES 01",28.73,68.319999999999993,2.95]
["POCES 02",33.409999999999997,64.02,2.57]
["BELLARIA 01",15.88,82.65,1.47]
["BELLARIA 02",7.93,90.86,1.21]
["POGAR",92.06,4.63,3.31]
["POCES 03",84.8,9.86,5.34]
["BELLARIA 03",83.12,1.7,15.18]
["CERVIA",90.86,4.34,4.8]

{"sheet":"Metals","index":3,"n_rows":61,"n_cols":12,"rows_kept":61,"cut":false,"hidden":false,"merged":[[0,11,0,13]]}
["Sample","Metals [mg/kg] →      ↓Fractions","Zn ","Ni","Cr","Pb","As","Hg","Cd","Cu","V","CLICK BELOW TO VIEW GRAPHICS (all data in mg/kg)"]
["POGAR","Dredged sediment",127.66522386990937,74.625631438299308,90.62,25.933140658868847,7.3158723999999999,3.1300000000000001E-2,0.71937393274245498,"-","-"]
[null,"-0,5 +0,063 mm",77.266243949362149,50.622721894125327,66.609137393642769,28.321737500989062,6.7676842099999996,1.8100000000000002E-2,0.133208163494445,"-","-"]
[null,"-0,063 mm",171.43055728278151,98.576909351493399,133.21108337740091,33.221095971306916,14.3732698248673,null,0.25309362735239399,"-","-"]
["POCES 03","Dredged sediment",84.465000000000003,10.385,41.93,50.26,17.535,5.2200000000000003E-2,0.46,23.965,35.42]
[null,"-2 +0,5 mm",107.91,35.519999999999996,39.89,34.869999999999997,71.105000000000004,6.5600000000000006E-2,0.66,65.824999999999989,35.96]
[null,"-0,5 +0,063 mm",85.405000000000001,43.89,43.9,40.055,15.84,4.5100000000000001E-2,0.42000000000000004,23.945,47.33]
[null,"-0,063 mm",118.605,53.914999999999999,65.89,39.450000000000003,15.9,5.33E-2,0.46,33.94,72.734999999999999]
["BELLARIA 03","Dredged sediment",65.324999999999989,31.949999999999996,53.904999999999994,31.36,10.844999999999999,8.3000000000000001E-3,0.48,13.984999999999999,56.935000000000002]
["BELLARIA 03","-1 +0,5 mm",45.314999999999998,35.935000000000002,23.954999999999998,16.335000000000001,5.61,7.6E-3,0.16,9.9849999999999994,"-"]
["BELLARIA 03","-0,5 +0,063 mm",63.5,35.945,87.860000000000014,32.99,8.8649999999999984,8.72E-2,0.45999999999999996,11.98,43.68]
["BELLARIA 03","-0,063 mm",156.57499999999999,61.835000000000001,81.78,27.605,18.490000000000002,1.7999999999999999E-2,0.30000000000000004,31.91,200.95499999999998]
["CERVIA","Dredged sediment",62.254999999999995,39.909999999999997,31.93,25.82,8.92,1.15E-2,0.3,13.97,53.25]
[null,"-0,5 +0,063 mm",61.9,49.92,67.89,24.119999999999997,6.71,1.9099999999999999E-2,0.30000000000000004,15.97,63.15]
[null,"-0,063 mm",131.79,59.9,55.91,27.074999999999999,6.87,5.7700000000000001E-2,0.12,31.95,119.81]
[]
[]
[]
[]
[]
[]
[]
[]
[]
[]
[]
[]
[]
[]
[]
[]
[]
[]
[]
[]
[]
[]
[]
[]
[]
[]
[]
[]
[]
[]
[]
[]
[]
[]
[]
[]
[]
[]
[]
[]
[]
[]
[]
[]
["SAND  Comparison "]
["SAND  Comparison "]

{"sheet":"Organic contaminants","index":4,"n_rows":22,"n_cols":6,"rows_kept":22,"cut":false,"hidden":false,"merged":[[0,5,1,7]]}
["Total PAH [ng/g]",null,null,null,null,"CLICK BELOW TO VIEW GRAPHICS (all data in ng/g)"]
[null,"Total PAH on dredged sediment","+0,5 mm","-0,5 +0,063 mm","-0,063 mm"]
["POCES 01",1649,"-","-","-"]
["POCES 02",3284,"-","-","-"]
["BELLARIA 01",367,"-","-","-"]
["BELLARIA 02",212,"-","-","-"]
["POGAR",164.77469450781462,14268.587981087054,56.421938589392887,228.53868060598055]
["POCES 03",2203.7058775086498,21472.835031726245,2608.3212151256776,233.42078603322724]
["BELLARIA 03",21.3,8.8435671869757755,22.377343463227835,479.09829890416046]
["CERVIA",171.5,"-",124.47807125916403,171.50824656293406]
[]
[]
["Total PCB [ng/g]"]
[null,"Total PCB on dredged sediment","+0,5 mm","-0,5 +0,063 mm","-0,063 mm"]
["POCES 01",11.7,"-","-","-"]
["POCES 02",10.7,"-","-","-"]
["BELLARIA 01",1.9,"-","-","-"]
["BELLARIA 02",2.6,"-","-","-"]
["POGAR",5.5140191676531076,28.895569207923646,4.6443140892527195,17.414869287522034]
["POCES 03",21.525123057798979,9.2573659630934149,7.9308823715678107,10.862763879066316]
["BELLARIA 03",0.5,0.36827419145788609,0.74723909294428914,25.09798151639156]
["CERVIA",1.3,"-",1.2244738035066991,14.400946185688944]

{"sheet":"Comparison with law limits","index":5,"n_rows":104,"n_cols":1,"rows_kept":104,"cut":false,"hidden":false,"merged":[]}
["Concentration values on dredged sediment higher than the Italian legislation limits (Soil type A)"]
[]
[]
[]
[]
[]
[]
[]
[]
[]
[]
[]
[]
[]
[]
[]
[]
[]
[]
[]
[]
["Comparison of concentration of metals with the Italian legislation limits (Soil type A)"]
[]
[]
[]
[]
[]
[]
[]
[]
[]
[]
[]
[]
[]
[]
[]
[]
[]
[]
[]
[]
[]
[]
[]
[]
[]
[]
[]
[]
[]
[]
[]
[]
[]
[]
[]
[]
[]
[]
[]
[]
[]
[]
[]
[]
[]
[]
[]
[]
[]
[]
[]
[]
[]
[]
[]
[]
[]
[]
[]
[]
[]
[]
[]
[]
[]
[]
[]
[]
[]
[]
[]
[]
[]
[]
[]
[]
[]
[]
[]
[]
[]
["Comparison of concentration of organics contaminants with the Italian legislation limits (Soil type A)"]